{"text_format":"1","workbook":"xlsx","n_sheets":4,"sheets":["IndividualCombined","IndividualPrecision","IndividualEconomy","TeamCombined"],"not_rendered":{"charts":0,"images":0,"macros":1,"external_links":1,"defined_names":0,"comments":0,"pivot_tables":1},"unopened":[],"bounds":{"document_bytes":16777216,"sheet_cells":100000,"rows_first":2000,"rows_last":500,"rows_between":2000,"halvings":0,"cell_chars":16384,"cell_head_chars":4096},"cells_cut":0,"cells_raw":0,"read":"whole","date_system":"1900"}

{"sheet":"IndividualCombined","index":0,"n_rows":52,"n_cols":21,"rows_kept":52,"cut":false,"hidden":false,"merged":[[1,16,2,18],[7,0,7,6],[5,4,6,4],[5,7,5,20],[5,0,6,0],[5,1,6,1],[5,2,6,2],[5,5,6,5],[5,6,6,6]]}
["Master Score"]
["Individual Combined",null,null,null,null,null,null,null,null,null,null,null,null,null,null,null,"Final"]
["Event:","3rd Thailand Paramotor King's Cup Open",null,null,null,"Total No. of Pilots:",null,{"$f":"[1]PilotReg!$F$2","v":44}]
["Venue:","Nong Kho, Chonburi, Thailand"]
[]
["Wing No. ","Colour","Pilot Name","Gender","Team","Total Score","Rank","Task Score"]
[null,null,null,null,null,null,null,1,2,3,4,5,6,7,8,9,10,11,12,13,14]
["Automatic Fields. Do not modify manually."]
[21,{"$f":"LOOKUP(A9,[1]PilotReg!$A:$A,[1]PilotReg!$B:$B)","v":"Orange-Blue"},{"$f":"LOOKUP(A9,[1]PilotReg!$A:$A,[1]PilotReg!$E:$E)","v":"Kittiphop Phrommat"},{"$f":"LOOKUP(A9,[1]PilotReg!$A:$A,[1]PilotReg!$G:$G)","v":"M"},{"$f":"LOOKUP(A9,[1]PilotReg!$A:$A,[1]PilotReg!$F:$F)","v":"Mosquito"},{"$f":"SUM(H9:U9)","v":379},{"$f":"RANK(F9,$F:$F)","v":1},30,19,30,30,30,30,19,30,30,30,16,30,30,25]
[19,{"$f":"LOOKUP(A10,[1]PilotReg!$A:$A,[1]PilotReg!$B:$B)","v":"Blue-Green"},{"$f":"LOOKUP(A10,[1]PilotReg!$A:$A,[1]PilotReg!$E:$E)","v":"Phrompiriya Tapeanthong"},{"$f":"LOOKUP(A10,[1]PilotReg!$A:$A,[1]PilotReg!$G:$G)","v":"M"},{"$f":"LOOKUP(A10,[1]PilotReg!$A:$A,[1]PilotReg!$F:$F)","v":"Mosquito"},331,2,30,20,30,19,16,30,30,30,17,30,19,19,25,16]
[5,{"$f":"LOOKUP(A11,[1]PilotReg!$A:$A,[1]PilotReg!$B:$B)","v":"Red-Orange"},{"$f":"LOOKUP(A11,[1]PilotReg!$A:$A,[1]PilotReg!$E:$E)","v":"Daniel Macak"},{"$f":"LOOKUP(A11,[1]PilotReg!$A:$A,[1]PilotReg!$G:$G)","v":"M"},{"$f":"LOOKUP(A11,[1]PilotReg!$A:$A,[1]PilotReg!$F:$F)","v":"Siam Junior"},318,3,30,18,30,18,17,30,7,30,20,30,15,25,30,18]
[29,{"$f":"LOOKUP(A12,[1]PilotReg!$A:$A,[1]PilotReg!$B:$B)","v":"Orange-Grey"},{"$f":"LOOKUP(A12,[1]PilotReg!$A:$A,[1]PilotReg!$E:$E)","v":"Pongnarin Somboon"},{"$f":"LOOKUP(A12,[1]PilotReg!$A:$A,[1]PilotReg!$G:$G)","v":"M"},{"$f":"LOOKUP(A12,[1]PilotReg!$A:$A,[1]PilotReg!$F:$F)","v":"Siam Junior"},304,4,30,30,30,17,10,30,10,25,19,30,22,13,30,8]
[36,{"$f":"LOOKUP(A13,[1]PilotReg!$A:$A,[1]PilotReg!$B:$B)","v":"Orange-Blue"},{"$f":"LOOKUP(A13,[1]PilotReg!$A:$A,[1]PilotReg!$E:$E)","v":"Chayaphong Pothipuk"},{"$f":"LOOKUP(A13,[1]PilotReg!$A:$A,[1]PilotReg!$G:$G)","v":"M"},{"$f":"LOOKUP(A13,[1]PilotReg!$A:$A,[1]PilotReg!$F:$F)","v":"Polly Thailand"},301,5,30,3,30,25,2,30,20,30,18,30,25,14,30,14]
[15,{"$f":"LOOKUP(A14,[1]PilotReg!$A:$A,[1]PilotReg!$B:$B)","v":"Blue-White"},{"$f":"LOOKUP(A14,[1]PilotReg!$A:$A,[1]PilotReg!$E:$E)","v":"David Graupera"},{"$f":"LOOKUP(A14,[1]PilotReg!$A:$A,[1]PilotReg!$G:$G)","v":"M"},{"$f":"LOOKUP(A14,[1]PilotReg!$A:$A,[1]PilotReg!$F:$F)","v":"Isarn Club"},298,6,30,2,30,14,19,25,16,30,15,30,18,22,30,17]
[12,{"$f":"LOOKUP(A15,[1]PilotReg!$A:$A,[1]PilotReg!$B:$B)","v":"Blue-White"},{"$f":"LOOKUP(A15,[1]PilotReg!$A:$A,[1]PilotReg!$E:$E)","v":"Noppanai Jaisawang"},{"$f":"LOOKUP(A15,[1]PilotReg!$A:$A,[1]PilotReg!$G:$G)","v":"M"},{"$f":"LOOKUP(A15,[1]PilotReg!$A:$A,[1]PilotReg!$F:$F)","v":"Moobin"},295,7,30,17,30,9,22,30,14,30,11,30,8,22,30,12]
[34,{"$f":"LOOKUP(A16,[1]PilotReg!$A:$A,[1]PilotReg!$B:$B)","v":"Red-Grey"},{"$f":"LOOKUP(A16,[1]PilotReg!$A:$A,[1]PilotReg!$E:$E)","v":"Panupong Tipayachan"},{"$f":"LOOKUP(A16,[1]PilotReg!$A:$A,[1]PilotReg!$G:$G)","v":"M"},{"$f":"LOOKUP(A16,[1]PilotReg!$A:$A,[1]PilotReg!$F:$F)","v":"Aunza Thailand"},288,8,30,2,30,20,2,30,9,30,22,30,10,13,30,30]
[7,{"$f":"LOOKUP(A17,[1]PilotReg!$A:$A,[1]PilotReg!$B:$B)","v":"Red-Black"},{"$f":"LOOKUP(A17,[1]PilotReg!$A:$A,[1]PilotReg!$E:$E)","v":"Kerkrit Meunphukiew"},{"$f":"LOOKUP(A17,[1]PilotReg!$A:$A,[1]PilotReg!$G:$G)","v":"M"},{"$f":"LOOKUP(A17,[1]PilotReg!$A:$A,[1]PilotReg!$F:$F)","v":"Mosquito"},285,9,30,22,30,7,7,30,25,30,12,25,8,9,30,20]
[10,{"$f":"LOOKUP(A18,[1]PilotReg!$A:$A,[1]PilotReg!$B:$B)","v":"Orange-Blue"},{"$f":"LOOKUP(A18,[1]PilotReg!$A:$A,[1]PilotReg!$E:$E)","v":"Noparat Intharaumnuay"},{"$f":"LOOKUP(A18,[1]PilotReg!$A:$A,[1]PilotReg!$G:$G)","v":"M"},{"$f":"LOOKUP(A18,[1]PilotReg!$A:$A,[1]PilotReg!$F:$F)","v":"Mosquito"},279,10,30,10,30,16,2,30,22,30,13,30,8,13,30,15]
[32,{"$f":"LOOKUP(A19,[1]PilotReg!$A:$A,[1]PilotReg!$B:$B)","v":"Red-White"},{"$f":"LOOKUP(A19,[1]PilotReg!$A:$A,[1]PilotReg!$E:$E)","v":"Saman Promnaree"},{"$f":"LOOKUP(A19,[1]PilotReg!$A:$A,[1]PilotReg!$G:$G)","v":"M"},{"$f":"LOOKUP(A19,[1]PilotReg!$A:$A,[1]PilotReg!$F:$F)","v":"Mosquito"},273,11,25,2,30,15,8,30,15,30,9,25,17,15,30,22]
[26,{"$f":"LOOKUP(A20,[1]PilotReg!$A:$A,[1]PilotReg!$B:$B)","v":"Red-Grey"},{"$f":"LOOKUP(A20,[1]PilotReg!$A:$A,[1]PilotReg!$E:$E)","v":"Pinit Kingtong"},{"$f":"LOOKUP(A20,[1]PilotReg!$A:$A,[1]PilotReg!$G:$G)","v":"M"},{"$f":"LOOKUP(A20,[1]PilotReg!$A:$A,[1]PilotReg!$F:$F)","v":"Moobin"},269,12,25,14,30,12,15,30,9,30,14,30,8,19,30,3]
[33,{"$f":"LOOKUP(A21,[1]PilotReg!$A:$A,[1]PilotReg!$B:$B)","v":"Black-Yellow"},{"$f":"LOOKUP(A21,[1]PilotReg!$A:$A,[1]PilotReg!$E:$E)","v":"Pongkorn Thanasakulkornsaeng"},{"$f":"LOOKUP(A21,[1]PilotReg!$A:$A,[1]PilotReg!$G:$G)","v":"M"},{"$f":"LOOKUP(A21,[1]PilotReg!$A:$A,[1]PilotReg!$F:$F)","v":"Polly Thailand"},265,13,25,2,30,22,2,25,17,30,25,30,11,5,22,19]
[45,{"$f":"LOOKUP(A22,[1]PilotReg!$A:$A,[1]PilotReg!$B:$B)","v":"Blue-Red"},{"$f":"LOOKUP(A22,[1]PilotReg!$A:$A,[1]PilotReg!$E:$E)","v":"Jiangsak Puangpee"},{"$f":"LOOKUP(A22,[1]PilotReg!$A:$A,[1]PilotReg!$G:$G)","v":"M"},{"$f":"LOOKUP(A22,[1]PilotReg!$A:$A,[1]PilotReg!$F:$F)","v":"Doklumduan"},264,14,30,2,30,13,14,30,13,30,16,30,8,13,30,5]
[23,{"$f":"LOOKUP(A23,[1]PilotReg!$A:$A,[1]PilotReg!$B:$B)","v":"Black-Blue"},{"$f":"LOOKUP(A23,[1]PilotReg!$A:$A,[1]PilotReg!$E:$E)","v":"Prakit Binkaew"},{"$f":"LOOKUP(A23,[1]PilotReg!$A:$A,[1]PilotReg!$G:$G)","v":"M"},{"$f":"LOOKUP(A23,[1]PilotReg!$A:$A,[1]PilotReg!$F:$F)","v":"Individual"},256,15,30,13,30,4,12,30,7,30,10,30,8,16,30,6]
[37,{"$f":"LOOKUP(A24,[1]PilotReg!$A:$A,[1]PilotReg!$B:$B)","v":"Grey-Red"},{"$f":"LOOKUP(A24,[1]PilotReg!$A:$A,[1]PilotReg!$E:$E)","v":"Sirichok Putaworn"},{"$f":"LOOKUP(A24,[1]PilotReg!$A:$A,[1]PilotReg!$G:$G)","v":"M"},{"$f":"LOOKUP(A24,[1]PilotReg!$A:$A,[1]PilotReg!$F:$F)","v":"Individual"},246,16,30,4,30,10,13,30,2,25,8,30,8,17,30,9]
[48,{"$f":"LOOKUP(A25,[1]PilotReg!$A:$A,[1]PilotReg!$B:$B)","v":"Green-Yellow"},{"$f":"LOOKUP(A25,[1]PilotReg!$A:$A,[1]PilotReg!$E:$E)","v":"Nut Thanaphuthiphong"},{"$f":"LOOKUP(A25,[1]PilotReg!$A:$A,[1]PilotReg!$G:$G)","v":"M"},{"$f":"LOOKUP(A25,[1]PilotReg!$A:$A,[1]PilotReg!$F:$F)","v":"Individual"},246,16,30,16,30,2,2,30,2,30,5,30,30,2,30,7]
[13,{"$f":"LOOKUP(A26,[1]PilotReg!$A:$A,[1]PilotReg!$B:$B)","v":"Black-Green"},{"$f":"LOOKUP(A26,[1]PilotReg!$A:$A,[1]PilotReg!$E:$E)","v":"Yuttaphol Anantawichain"},{"$f":"LOOKUP(A26,[1]PilotReg!$A:$A,[1]PilotReg!$G:$G)","v":"M"},{"$f":"LOOKUP(A26,[1]PilotReg!$A:$A,[1]PilotReg!$F:$F)","v":"4st Mahongsorn"},243,18,30,25,30,2,2,30,11,30,4,30,9,2,25,13]
[2,{"$f":"LOOKUP(A27,[1]PilotReg!$A:$A,[1]PilotReg!$B:$B)","v":"Red-Orange"},{"$f":"LOOKUP(A27,[1]PilotReg!$A:$A,[1]PilotReg!$E:$E)","v":"Aroonrat Jongonklang"},{"$f":"LOOKUP(A27,[1]PilotReg!$A:$A,[1]PilotReg!$G:$G)","v":"F"},{"$f":"LOOKUP(A27,[1]PilotReg!$A:$A,[1]PilotReg!$F:$F)","v":"Polly Thailand"},228,19,30,12,30,2,18,22,3,25,2,30,20,2,30,2]
[20,{"$f":"LOOKUP(A28,[1]PilotReg!$A:$A,[1]PilotReg!$B:$B)","v":"Purple-Orange"},{"$f":"LOOKUP(A28,[1]PilotReg!$A:$A,[1]PilotReg!$E:$E)","v":"Somponk Busabonk"},{"$f":"LOOKUP(A28,[1]PilotReg!$A:$A,[1]PilotReg!$G:$G)","v":"M"},{"$f":"LOOKUP(A28,[1]PilotReg!$A:$A,[1]PilotReg!$F:$F)","v":"Moobin"},221,20,25,2,30,11,2,25,2,30,7,30,8,9,30,10]
[38,{"$f":"LOOKUP(A29,[1]PilotReg!$A:$A,[1]PilotReg!$B:$B)","v":"Black-White"},{"$f":"LOOKUP(A29,[1]PilotReg!$A:$A,[1]PilotReg!$E:$E)","v":"Chaiyapin Chaininwan"},{"$f":"LOOKUP(A29,[1]PilotReg!$A:$A,[1]PilotReg!$G:$G)","v":"M"},{"$f":"LOOKUP(A29,[1]PilotReg!$A:$A,[1]PilotReg!$F:$F)","v":"Isarn Club"},219,21,30,2,30,8,2,30,12,30,2,30,8,2,22,11]
[30,{"$f":"LOOKUP(A30,[1]PilotReg!$A:$A,[1]PilotReg!$B:$B)","v":"Red-White"},{"$f":"LOOKUP(A30,[1]PilotReg!$A:$A,[1]PilotReg!$E:$E)","v":"Pattarin Insornsart"},{"$f":"LOOKUP(A30,[1]PilotReg!$A:$A,[1]PilotReg!$G:$G)","v":"F"},{"$f":"LOOKUP(A30,[1]PilotReg!$A:$A,[1]PilotReg!$F:$F)","v":"4st Mahongsorn"},217,22,30,2,30,2,25,30,2,30,2,22,8,2,30,2]
[31,{"$f":"LOOKUP(A31,[1]PilotReg!$A:$A,[1]PilotReg!$B:$B)","v":"Yellow-Red"},{"$f":"LOOKUP(A31,[1]PilotReg!$A:$A,[1]PilotReg!$E:$E)","v":"Pongparn Supasorn"},{"$f":"LOOKUP(A31,[1]PilotReg!$A:$A,[1]PilotReg!$G:$G)","v":"M"},{"$f":"LOOKUP(A31,[1]PilotReg!$A:$A,[1]PilotReg!$F:$F)","v":"Ubonratchathani Aero Club"},215,23,30,2,30,6,5,30,2,30,6,30,8,2,30,4]
[27,{"$f":"LOOKUP(A32,[1]PilotReg!$A:$A,[1]PilotReg!$B:$B)","v":"Black-Grey"},{"$f":"LOOKUP(A32,[1]PilotReg!$A:$A,[1]PilotReg!$E:$E)","v":"Nipon Somsri"},{"$f":"LOOKUP(A32,[1]PilotReg!$A:$A,[1]PilotReg!$G:$G)","v":"M"},{"$f":"LOOKUP(A32,[1]PilotReg!$A:$A,[1]PilotReg!$F:$F)","v":"Isarn Club"},211,24,30,11,30,2,2,30,2,30,3,25,8,6,30,2]
[4,{"$f":"LOOKUP(A33,[1]PilotReg!$A:$A,[1]PilotReg!$B:$B)","v":"Blue-Red"},{"$f":"LOOKUP(A33,[1]PilotReg!$A:$A,[1]PilotReg!$E:$E)","v":"Chakrit Babphan"},{"$f":"LOOKUP(A33,[1]PilotReg!$A:$A,[1]PilotReg!$G:$G)","v":"M"},{"$f":"LOOKUP(A33,[1]PilotReg!$A:$A,[1]PilotReg!$F:$F)","v":"Moobin"},209,25,30,7,30,2,2,30,7,30,2,30,12,0,25,2]
[22,{"$f":"LOOKUP(A34,[1]PilotReg!$A:$A,[1]PilotReg!$B:$B)","v":"Blue-Grey"},{"$f":"LOOKUP(A34,[1]PilotReg!$A:$A,[1]PilotReg!$E:$E)","v":"Nutchai Dadrung"},{"$f":"LOOKUP(A34,[1]PilotReg!$A:$A,[1]PilotReg!$G:$G)","v":"M"},{"$f":"LOOKUP(A34,[1]PilotReg!$A:$A,[1]PilotReg!$F:$F)","v":"Moobin"},207,26,30,2,30,2,2,30,0,30,2,30,8,9,30,2]
[11,{"$f":"LOOKUP(A35,[1]PilotReg!$A:$A,[1]PilotReg!$B:$B)","v":"Red-Blk-White"},{"$f":"LOOKUP(A35,[1]PilotReg!$A:$A,[1]PilotReg!$E:$E)","v":"Soratat Thongsub"},{"$f":"LOOKUP(A35,[1]PilotReg!$A:$A,[1]PilotReg!$G:$G)","v":"M"},{"$f":"LOOKUP(A35,[1]PilotReg!$A:$A,[1]PilotReg!$F:$F)","v":"Doklumduan"},205,27,30,8,25,3,2,30,2,30,2,30,8,3,30,2]
[43,{"$f":"LOOKUP(A36,[1]PilotReg!$A:$A,[1]PilotReg!$B:$B)","v":"Yellow-White"},{"$f":"LOOKUP(A36,[1]PilotReg!$A:$A,[1]PilotReg!$E:$E)","v":"A  Aongard"},{"$f":"LOOKUP(A36,[1]PilotReg!$A:$A,[1]PilotReg!$G:$G)","v":"M"},{"$f":"LOOKUP(A36,[1]PilotReg!$A:$A,[1]PilotReg!$F:$F)","v":"Siam Junior"},205,27,30,16,30,2,2,30,18,30,0,30,14,3,0,0]
[3,{"$f":"LOOKUP(A37,[1]PilotReg!$A:$A,[1]PilotReg!$B:$B)","v":"Orange-Green"},{"$f":"LOOKUP(A37,[1]PilotReg!$A:$A,[1]PilotReg!$E:$E)","v":"Avasda Chaisorn"},{"$f":"LOOKUP(A37,[1]PilotReg!$A:$A,[1]PilotReg!$G:$G)","v":"F"},{"$f":"LOOKUP(A37,[1]PilotReg!$A:$A,[1]PilotReg!$F:$F)","v":"4st Mahongsorn"},204,29,30,2,30,2,9,30,2,30,2,25,8,2,30,2]
[8,{"$f":"LOOKUP(A38,[1]PilotReg!$A:$A,[1]PilotReg!$B:$B)","v":"White"},{"$f":"LOOKUP(A38,[1]PilotReg!$A:$A,[1]PilotReg!$E:$E)","v":"Plaifha Thongdonpum"},{"$f":"LOOKUP(A38,[1]PilotReg!$A:$A,[1]PilotReg!$G:$G)","v":"F"},{"$f":"LOOKUP(A38,[1]PilotReg!$A:$A,[1]PilotReg!$F:$F)","v":"Siam Junior"},203,30,30,9,22,2,4,30,2,30,2,30,8,2,30,2]
[17,{"$f":"LOOKUP(A39,[1]PilotReg!$A:$A,[1]PilotReg!$B:$B)","v":"Black-Orange"},{"$f":"LOOKUP(A39,[1]PilotReg!$A:$A,[1]PilotReg!$E:$E)","v":"Chanapa Sermsai"},{"$f":"LOOKUP(A39,[1]PilotReg!$A:$A,[1]PilotReg!$G:$G)","v":"F"},{"$f":"LOOKUP(A39,[1]PilotReg!$A:$A,[1]PilotReg!$F:$F)","v":"Aunza Thailand"},202,31,30,2,30,2,2,30,2,30,2,30,8,2,30,2]
[35,{"$f":"LOOKUP(A40,[1]PilotReg!$A:$A,[1]PilotReg!$B:$B)","v":"Green-Red"},{"$f":"LOOKUP(A40,[1]PilotReg!$A:$A,[1]PilotReg!$E:$E)","v":"Kittisak Khamwongpin"},{"$f":"LOOKUP(A40,[1]PilotReg!$A:$A,[1]PilotReg!$G:$G)","v":"M"},{"$f":"LOOKUP(A40,[1]PilotReg!$A:$A,[1]PilotReg!$F:$F)","v":"Doklumduan"},201,32,30,2,30,0,3,30,7,25,2,30,8,2,30,2]
[25,{"$f":"LOOKUP(A41,[1]PilotReg!$A:$A,[1]PilotReg!$B:$B)","v":"Red-Yellow"},{"$f":"LOOKUP(A41,[1]PilotReg!$A:$A,[1]PilotReg!$E:$E)","v":"Piyapong Tremsap"},{"$f":"LOOKUP(A41,[1]PilotReg!$A:$A,[1]PilotReg!$G:$G)","v":"M"},{"$f":"LOOKUP(A41,[1]PilotReg!$A:$A,[1]PilotReg!$F:$F)","v":"Ubonratchathani Aero Club"},200,33,25,2,30,2,2,30,0,30,2,30,13,2,30,2]
[9,{"$f":"LOOKUP(A42,[1]PilotReg!$A:$A,[1]PilotReg!$B:$B)","v":"Blue-White"},{"$f":"LOOKUP(A42,[1]PilotReg!$A:$A,[1]PilotReg!$E:$E)","v":"Paramin Sangkaew"},{"$f":"LOOKUP(A42,[1]PilotReg!$A:$A,[1]PilotReg!$G:$G)","v":"M"},{"$f":"LOOKUP(A42,[1]PilotReg!$A:$A,[1]PilotReg!$F:$F)","v":"Doklumduan"},197,34,30,2,30,2,2,30,2,30,2,25,8,2,30,2]
[16,{"$f":"LOOKUP(A43,[1]PilotReg!$A:$A,[1]PilotReg!$B:$B)","v":"Blue-Orange"},{"$f":"LOOKUP(A43,[1]PilotReg!$A:$A,[1]PilotReg!$E:$E)","v":"Jirasak Viteetham"},{"$f":"LOOKUP(A43,[1]PilotReg!$A:$A,[1]PilotReg!$G:$G)","v":"M"},{"$f":"LOOKUP(A43,[1]PilotReg!$A:$A,[1]PilotReg!$F:$F)","v":"Isarn Club"},184,35,30,6,22,5,2,22,2,20,2,30,8,3,30,2]
[14,{"$f":"LOOKUP(A44,[1]PilotReg!$A:$A,[1]PilotReg!$B:$B)","v":"Red"},{"$f":"LOOKUP(A44,[1]PilotReg!$A:$A,[1]PilotReg!$E:$E)","v":"Kittipas Boonkoom"},{"$f":"LOOKUP(A44,[1]PilotReg!$A:$A,[1]PilotReg!$G:$G)","v":"M"},{"$f":"LOOKUP(A44,[1]PilotReg!$A:$A,[1]PilotReg!$F:$F)","v":"Doklumduan"},177,36,22,2,25,2,2,30,2,30,2,25,8,0,25,2]
[6,{"$f":"LOOKUP(A45,[1]PilotReg!$A:$A,[1]PilotReg!$B:$B)","v":"Orange-White"},{"$f":"LOOKUP(A45,[1]PilotReg!$A:$A,[1]PilotReg!$E:$E)","v":"Suriyon Sungsook"},{"$f":"LOOKUP(A45,[1]PilotReg!$A:$A,[1]PilotReg!$G:$G)","v":"M"},{"$f":"LOOKUP(A45,[1]PilotReg!$A:$A,[1]PilotReg!$F:$F)","v":"4st Mahongsorn"},167,37,30,2,30,2,11,30,2,30,0,30,0,0,0,0]
[40,{"$f":"LOOKUP(A46,[1]PilotReg!$A:$A,[1]PilotReg!$B:$B)","v":"White"},{"$f":"LOOKUP(A46,[1]PilotReg!$A:$A,[1]PilotReg!$E:$E)","v":"Gorbua Yenvaree"},{"$f":"LOOKUP(A46,[1]PilotReg!$A:$A,[1]PilotReg!$G:$G)","v":"F"},{"$f":"LOOKUP(A46,[1]PilotReg!$A:$A,[1]PilotReg!$F:$F)","v":"Aunza Thailand"},164,38,22,2,0,0,20,30,2,22,2,22,8,2,30,2]
[44,{"$f":"LOOKUP(A47,[1]PilotReg!$A:$A,[1]PilotReg!$B:$B)","v":"Blue-Yellow"},{"$f":"LOOKUP(A47,[1]PilotReg!$A:$A,[1]PilotReg!$E:$E)","v":"Woraphot Khamchomphu"},{"$f":"LOOKUP(A47,[1]PilotReg!$A:$A,[1]PilotReg!$G:$G)","v":"M"},{"$f":"LOOKUP(A47,[1]PilotReg!$A:$A,[1]PilotReg!$F:$F)","v":"Ubonratchathani Aero Club"},158,39,30,5,0,0,2,30,0,30,2,22,8,2,25,2]
[1,{"$f":"LOOKUP(A48,[1]PilotReg!$A:$A,[1]PilotReg!$B:$B)","v":"Orange-Blue"},{"$f":"LOOKUP(A48,[1]PilotReg!$A:$A,[1]PilotReg!$E:$E)","v":"Tanaporn Panapho"},{"$f":"LOOKUP(A48,[1]PilotReg!$A:$A,[1]PilotReg!$G:$G)","v":"F"},{"$f":"LOOKUP(A48,[1]PilotReg!$A:$A,[1]PilotReg!$F:$F)","v":"Aunza Thailand"},129,40,22,2,0,0,6,25,2,30,2,30,8,2,0,0]
[18,{"$f":"LOOKUP(A49,[1]PilotReg!$A:$A,[1]PilotReg!$B:$B)","v":"Blue-Green"},{"$f":"LOOKUP(A49,[1]PilotReg!$A:$A,[1]PilotReg!$E:$E)","v":"Anuparp Sura"},{"$f":"LOOKUP(A49,[1]PilotReg!$A:$A,[1]PilotReg!$G:$G)","v":"M"},{"$f":"LOOKUP(A49,[1]PilotReg!$A:$A,[1]PilotReg!$F:$F)","v":"Polly Thailand"},94,41,30,2,30,2,0,0,0,30,0,0,0,0,0,0]
[28,{"$f":"LOOKUP(A50,[1]PilotReg!$A:$A,[1]PilotReg!$B:$B)","v":"Orange-Red"},{"$f":"LOOKUP(A50,[1]PilotReg!$A:$A,[1]PilotReg!$E:$E)","v":"Puja Laksana"},{"$f":"LOOKUP(A50,[1]PilotReg!$A:$A,[1]PilotReg!$G:$G)","v":"M"},{"$f":"LOOKUP(A50,[1]PilotReg!$A:$A,[1]PilotReg!$F:$F)","v":"Individual"},62,42,30,2,0,0,0,0,0,30,0,0,0,0,0,0]
[42,{"$f":"LOOKUP(A51,[1]PilotReg!$A:$A,[1]PilotReg!$B:$B)","v":"Red-Blue"},{"$f":"LOOKUP(A51,[1]PilotReg!$A:$A,[1]PilotReg!$E:$E)","v":"Chanin Chaithaset"},{"$f":"LOOKUP(A51,[1]PilotReg!$A:$A,[1]PilotReg!$G:$G)","v":"M"},{"$f":"LOOKUP(A51,[1]PilotReg!$A:$A,[1]PilotReg!$F:$F)","v":"Isarn Club"},62,42,30,2,0,0,0,0,0,30,0,0,0,0,0,0]
[39,{"$f":"LOOKUP(A52,[1]PilotReg!$A:$A,[1]PilotReg!$B:$B)","v":"Blue-Black"},{"$f":"LOOKUP(A52,[1]PilotReg!$A:$A,[1]PilotReg!$E:$E)","v":"Naruporn Wathaya"},{"$f":"LOOKUP(A52,[1]PilotReg!$A:$A,[1]PilotReg!$G:$G)","v":"F"},{"$f":"LOOKUP(A52,[1]PilotReg!$A:$A,[1]PilotReg!$F:$F)","v":"Siam Junior"},54,44,20,2,0,0,0,0,0,30,0,0,0,2,0,0]

{"sheet":"IndividualPrecision","index":1,"n_rows":52,"n_cols":19,"rows_kept":52,"cut":false,"hidden":false,"merged":[[7,0,7,6],[1,14,2,16],[5,0,6,0],[5,1,6,1],[5,2,6,2],[5,4,6,4],[5,5,6,5],[5,6,6,6],[5,7,5,18]]}
["Master Score"]
["Individual Precision",null,null,null,null,null,null,null,null,null,null,null,null,null,"Final"]
["Event:","3rd Thailand Paramotor King's Cup Open",null,null,null,"Total No. of Pilots:",null,{"$f":"[1]PilotReg!$F$2","v":44}]
["Venue:","Nong Kho, Chonburi, Thailand"]
[]
["Wing No. ","Colour","Pilot Name","Gender","Team","Total Score","Rank","Task Score"]
[null,null,null,null,null,null,null,1,2,3,4,6,7,8,9,10,11,13,14]
["Automatic Fields. Do not modify manually."]
[21,{"$f":"LOOKUP(A9,[1]PilotReg!$A:$A,[1]PilotReg!$B:$B)","v":"Orange-Blue"},{"$f":"LOOKUP(A9,[1]PilotReg!$A:$A,[1]PilotReg!$E:$E)","v":"Kittiphop Phrommat"},{"$f":"LOOKUP(A9,[1]PilotReg!$A:$A,[1]PilotReg!$G:$G)","v":"M"},{"$f":"LOOKUP(A9,[1]PilotReg!$A:$A,[1]PilotReg!$F:$F)","v":"Mosquito"},{"$f":"SUM(H9:S9)","v":319},{"$f":"RANK(F9,$F:$F)","v":1},30,19,30,30,30,19,30,30,30,16,30,25]
[19,{"$f":"LOOKUP(A10,[1]PilotReg!$A:$A,[1]PilotReg!$B:$B)","v":"Blue-Green"},{"$f":"LOOKUP(A10,[1]PilotReg!$A:$A,[1]PilotReg!$E:$E)","v":"Phrompiriya Tapeanthong"},{"$f":"LOOKUP(A10,[1]PilotReg!$A:$A,[1]PilotReg!$G:$G)","v":"M"},{"$f":"LOOKUP(A10,[1]PilotReg!$A:$A,[1]PilotReg!$F:$F)","v":"Mosquito"},296,2,30,20,30,19,30,30,30,17,30,19,25,16]
[36,{"$f":"LOOKUP(A11,[1]PilotReg!$A:$A,[1]PilotReg!$B:$B)","v":"Orange-Blue"},{"$f":"LOOKUP(A11,[1]PilotReg!$A:$A,[1]PilotReg!$E:$E)","v":"Chayaphong Pothipuk"},{"$f":"LOOKUP(A11,[1]PilotReg!$A:$A,[1]PilotReg!$G:$G)","v":"M"},{"$f":"LOOKUP(A11,[1]PilotReg!$A:$A,[1]PilotReg!$F:$F)","v":"Polly Thailand"},285,3,30,3,30,25,30,20,30,18,30,25,30,14]
[29,{"$f":"LOOKUP(A12,[1]PilotReg!$A:$A,[1]PilotReg!$B:$B)","v":"Orange-Grey"},{"$f":"LOOKUP(A12,[1]PilotReg!$A:$A,[1]PilotReg!$E:$E)","v":"Pongnarin Somboon"},{"$f":"LOOKUP(A12,[1]PilotReg!$A:$A,[1]PilotReg!$G:$G)","v":"M"},{"$f":"LOOKUP(A12,[1]PilotReg!$A:$A,[1]PilotReg!$F:$F)","v":"Siam Junior"},281,4,30,30,30,17,30,10,25,19,30,22,30,8]
[5,{"$f":"LOOKUP(A13,[1]PilotReg!$A:$A,[1]PilotReg!$B:$B)","v":"Red-Orange"},{"$f":"LOOKUP(A13,[1]PilotReg!$A:$A,[1]PilotReg!$E:$E)","v":"Daniel Macak"},{"$f":"LOOKUP(A13,[1]PilotReg!$A:$A,[1]PilotReg!$G:$G)","v":"M"},{"$f":"LOOKUP(A13,[1]PilotReg!$A:$A,[1]PilotReg!$F:$F)","v":"Siam Junior"},276,5,30,18,30,18,30,7,30,20,30,15,30,18]
[34,{"$f":"LOOKUP(A14,[1]PilotReg!$A:$A,[1]PilotReg!$B:$B)","v":"Red-Grey"},{"$f":"LOOKUP(A14,[1]PilotReg!$A:$A,[1]PilotReg!$E:$E)","v":"Panupong Tipayachan"},{"$f":"LOOKUP(A14,[1]PilotReg!$A:$A,[1]PilotReg!$G:$G)","v":"M"},{"$f":"LOOKUP(A14,[1]PilotReg!$A:$A,[1]PilotReg!$F:$F)","v":"Aunza Thailand"},273,6,30,2,30,20,30,9,30,22,30,10,30,30]
[7,{"$f":"LOOKUP(A15,[1]PilotReg!$A:$A,[1]PilotReg!$B:$B)","v":"Red-Black"},{"$f":"LOOKUP(A15,[1]PilotReg!$A:$A,[1]PilotReg!$E:$E)","v":"Kerkrit Meunphukiew"},{"$f":"LOOKUP(A15,[1]PilotReg!$A:$A,[1]PilotReg!$G:$G)","v":"M"},{"$f":"LOOKUP(A15,[1]PilotReg!$A:$A,[1]PilotReg!$F:$F)","v":"Mosquito"},269,7,30,22,30,7,30,25,30,12,25,8,30,20]
[10,{"$f":"LOOKUP(A16,[1]PilotReg!$A:$A,[1]PilotReg!$B:$B)","v":"Orange-Blue"},{"$f":"LOOKUP(A16,[1]PilotReg!$A:$A,[1]PilotReg!$E:$E)","v":"Noparat Intharaumnuay"},{"$f":"LOOKUP(A16,[1]PilotReg!$A:$A,[1]PilotReg!$G:$G)","v":"M"},{"$f":"LOOKUP(A16,[1]PilotReg!$A:$A,[1]PilotReg!$F:$F)","v":"Mosquito"},264,8,30,10,30,16,30,22,30,13,30,8,30,15]
[33,{"$f":"LOOKUP(A17,[1]PilotReg!$A:$A,[1]PilotReg!$B:$B)","v":"Black-Yellow"},{"$f":"LOOKUP(A17,[1]PilotReg!$A:$A,[1]PilotReg!$E:$E)","v":"Pongkorn Thanasakulkornsaeng"},{"$f":"LOOKUP(A17,[1]PilotReg!$A:$A,[1]PilotReg!$G:$G)","v":"M"},{"$f":"LOOKUP(A17,[1]PilotReg!$A:$A,[1]PilotReg!$F:$F)","v":"Polly Thailand"},258,9,25,2,30,22,25,17,30,25,30,11,22,19]
[15,{"$f":"LOOKUP(A18,[1]PilotReg!$A:$A,[1]PilotReg!$B:$B)","v":"Blue-White"},{"$f":"LOOKUP(A18,[1]PilotReg!$A:$A,[1]PilotReg!$E:$E)","v":"David Graupera"},{"$f":"LOOKUP(A18,[1]PilotReg!$A:$A,[1]PilotReg!$G:$G)","v":"M"},{"$f":"LOOKUP(A18,[1]PilotReg!$A:$A,[1]PilotReg!$F:$F)","v":"Isarn Club"},257,10,30,2,30,14,25,16,30,15,30,18,30,17]
[12,{"$f":"LOOKUP(A19,[1]PilotReg!$A:$A,[1]PilotReg!$B:$B)","v":"Blue-White"},{"$f":"LOOKUP(A19,[1]PilotReg!$A:$A,[1]PilotReg!$E:$E)","v":"Noppanai Jaisawang"},{"$f":"LOOKUP(A19,[1]PilotReg!$A:$A,[1]PilotReg!$G:$G)","v":"M"},{"$f":"LOOKUP(A19,[1]PilotReg!$A:$A,[1]PilotReg!$F:$F)","v":"Moobin"},251,11,30,17,30,9,30,14,30,11,30,8,30,12]
[32,{"$f":"LOOKUP(A20,[1]PilotReg!$A:$A,[1]PilotReg!$B:$B)","v":"Red-White"},{"$f":"LOOKUP(A20,[1]PilotReg!$A:$A,[1]PilotReg!$E:$E)","v":"Saman Promnaree"},{"$f":"LOOKUP(A20,[1]PilotReg!$A:$A,[1]PilotReg!$G:$G)","v":"M"},{"$f":"LOOKUP(A20,[1]PilotReg!$A:$A,[1]PilotReg!$F:$F)","v":"Mosquito"},250,12,25,2,30,15,30,15,30,9,25,17,30,22]
[48,{"$f":"LOOKUP(A21,[1]PilotReg!$A:$A,[1]PilotReg!$B:$B)","v":"Green-Yellow"},{"$f":"LOOKUP(A21,[1]PilotReg!$A:$A,[1]PilotReg!$E:$E)","v":"Nut Thanaphuthiphong"},{"$f":"LOOKUP(A21,[1]PilotReg!$A:$A,[1]PilotReg!$G:$G)","v":"M"},{"$f":"LOOKUP(A21,[1]PilotReg!$A:$A,[1]PilotReg!$F:$F)","v":"Individual"},242,13,30,16,30,2,30,2,30,5,30,30,30,7]
[13,{"$f":"LOOKUP(A22,[1]PilotReg!$A:$A,[1]PilotReg!$B:$B)","v":"Black-Green"},{"$f":"LOOKUP(A22,[1]PilotReg!$A:$A,[1]PilotReg!$E:$E)","v":"Yuttaphol Anantawichain"},{"$f":"LOOKUP(A22,[1]PilotReg!$A:$A,[1]PilotReg!$G:$G)","v":"M"},{"$f":"LOOKUP(A22,[1]PilotReg!$A:$A,[1]PilotReg!$F:$F)","v":"4st Mahongsorn"},239,14,30,25,30,2,30,11,30,4,30,9,25,13]
[45,{"$f":"LOOKUP(A23,[1]PilotReg!$A:$A,[1]PilotReg!$B:$B)","v":"Blue-Red"},{"$f":"LOOKUP(A23,[1]PilotReg!$A:$A,[1]PilotReg!$E:$E)","v":"Jiangsak Puangpee"},{"$f":"LOOKUP(A23,[1]PilotReg!$A:$A,[1]PilotReg!$G:$G)","v":"M"},{"$f":"LOOKUP(A23,[1]PilotReg!$A:$A,[1]PilotReg!$F:$F)","v":"Doklumduan"},237,15,30,2,30,13,30,13,30,16,30,8,30,5]
[26,{"$f":"LOOKUP(A24,[1]PilotReg!$A:$A,[1]PilotReg!$B:$B)","v":"Red-Grey"},{"$f":"LOOKUP(A24,[1]PilotReg!$A:$A,[1]PilotReg!$E:$E)","v":"Pinit Kingtong"},{"$f":"LOOKUP(A24,[1]PilotReg!$A:$A,[1]PilotReg!$G:$G)","v":"M"},{"$f":"LOOKUP(A24,[1]PilotReg!$A:$A,[1]PilotReg!$F:$F)","v":"Moobin"},235,16,25,14,30,12,30,9,30,14,30,8,30,3]
[23,{"$f":"LOOKUP(A25,[1]PilotReg!$A:$A,[1]PilotReg!$B:$B)","v":"Black-Blue"},{"$f":"LOOKUP(A25,[1]PilotReg!$A:$A,[1]PilotReg!$E:$E)","v":"Prakit Binkaew"},{"$f":"LOOKUP(A25,[1]PilotReg!$A:$A,[1]PilotReg!$G:$G)","v":"M"},{"$f":"LOOKUP(A25,[1]PilotReg!$A:$A,[1]PilotReg!$F:$F)","v":"Individual"},228,17,30,13,30,4,30,7,30,10,30,8,30,6]
[37,{"$f":"LOOKUP(A26,[1]PilotReg!$A:$A,[1]PilotReg!$B:$B)","v":"Grey-Red"},{"$f":"LOOKUP(A26,[1]PilotReg!$A:$A,[1]PilotReg!$E:$E)","v":"Sirichok Putaworn"},{"$f":"LOOKUP(A26,[1]PilotReg!$A:$A,[1]PilotReg!$G:$G)","v":"M"},{"$f":"LOOKUP(A26,[1]PilotReg!$A:$A,[1]PilotReg!$F:$F)","v":"Individual"},216,18,30,4,30,10,30,2,25,8,30,8,30,9]
[38,{"$f":"LOOKUP(A27,[1]PilotReg!$A:$A,[1]PilotReg!$B:$B)","v":"Black-White"},{"$f":"LOOKUP(A27,[1]PilotReg!$A:$A,[1]PilotReg!$E:$E)","v":"Chaiyapin Chaininwan"},{"$f":"LOOKUP(A27,[1]PilotReg!$A:$A,[1]PilotReg!$G:$G)","v":"M"},{"$f":"LOOKUP(A27,[1]PilotReg!$A:$A,[1]PilotReg!$F:$F)","v":"Isarn Club"},215,19,30,2,30,8,30,12,30,2,30,8,22,11]
[20,{"$f":"LOOKUP(A28,[1]PilotReg!$A:$A,[1]PilotReg!$B:$B)","v":"Purple-Orange"},{"$f":"LOOKUP(A28,[1]PilotReg!$A:$A,[1]PilotReg!$E:$E)","v":"Somponk Busabonk"},{"$f":"LOOKUP(A28,[1]PilotReg!$A:$A,[1]PilotReg!$G:$G)","v":"M"},{"$f":"LOOKUP(A28,[1]PilotReg!$A:$A,[1]PilotReg!$F:$F)","v":"Moobin"},210,20,25,2,30,11,25,2,30,7,30,8,30,10]
[2,{"$f":"LOOKUP(A29,[1]PilotReg!$A:$A,[1]PilotReg!$B:$B)","v":"Red-Orange"},{"$f":"LOOKUP(A29,[1]PilotReg!$A:$A,[1]PilotReg!$E:$E)","v":"Aroonrat Jongonklang"},{"$f":"LOOKUP(A29,[1]PilotReg!$A:$A,[1]PilotReg!$G:$G)","v":"F"},{"$f":"LOOKUP(A29,[1]PilotReg!$A:$A,[1]PilotReg!$F:$F)","v":"Polly Thailand"},208,21,30,12,30,2,22,3,25,2,30,20,30,2]
[31,{"$f":"LOOKUP(A30,[1]PilotReg!$A:$A,[1]PilotReg!$B:$B)","v":"Yellow-Red"},{"$f":"LOOKUP(A30,[1]PilotReg!$A:$A,[1]PilotReg!$E:$E)","v":"Pongparn Supasorn"},{"$f":"LOOKUP(A30,[1]PilotReg!$A:$A,[1]PilotReg!$G:$G)","v":"M"},{"$f":"LOOKUP(A30,[1]PilotReg!$A:$A,[1]PilotReg!$F:$F)","v":"Ubonratchathani Aero Club"},208,21,30,2,30,6,30,2,30,6,30,8,30,4]
[4,{"$f":"LOOKUP(A31,[1]PilotReg!$A:$A,[1]PilotReg!$B:$B)","v":"Blue-Red"},{"$f":"LOOKUP(A31,[1]PilotReg!$A:$A,[1]PilotReg!$E:$E)","v":"Chakrit Babphan"},{"$f":"LOOKUP(A31,[1]PilotReg!$A:$A,[1]PilotReg!$G:$G)","v":"M"},{"$f":"LOOKUP(A31,[1]PilotReg!$A:$A,[1]PilotReg!$F:$F)","v":"Moobin"},207,23,30,7,30,2,30,7,30,2,30,12,25,2]
[27,{"$f":"LOOKUP(A32,[1]PilotReg!$A:$A,[1]PilotReg!$B:$B)","v":"Black-Grey"},{"$f":"LOOKUP(A32,[1]PilotReg!$A:$A,[1]PilotReg!$E:$E)","v":"Nipon Somsri"},{"$f":"LOOKUP(A32,[1]PilotReg!$A:$A,[1]PilotReg!$G:$G)","v":"M"},{"$f":"LOOKUP(A32,[1]PilotReg!$A:$A,[1]PilotReg!$F:$F)","v":"Isarn Club"},203,24,30,11,30,2,30,2,30,3,25,8,30,2]
[11,{"$f":"LOOKUP(A33,[1]PilotReg!$A:$A,[1]PilotReg!$B:$B)","v":"Red-Blk-White"},{"$f":"LOOKUP(A33,[1]PilotReg!$A:$A,[1]PilotReg!$E:$E)","v":"Soratat Thongsub"},{"$f":"LOOKUP(A33,[1]PilotReg!$A:$A,[1]PilotReg!$G:$G)","v":"M"},{"$f":"LOOKUP(A33,[1]PilotReg!$A:$A,[1]PilotReg!$F:$F)","v":"Doklumduan"},200,25,30,8,25,3,30,2,30,2,30,8,30,2]
[43,{"$f":"LOOKUP(A34,[1]PilotReg!$A:$A,[1]PilotReg!$B:$B)","v":"Yellow-White"},{"$f":"LOOKUP(A34,[1]PilotReg!$A:$A,[1]PilotReg!$E:$E)","v":"A  Aongard"},{"$f":"LOOKUP(A34,[1]PilotReg!$A:$A,[1]PilotReg!$G:$G)","v":"M"},{"$f":"LOOKUP(A34,[1]PilotReg!$A:$A,[1]PilotReg!$F:$F)","v":"Siam Junior"},200,25,30,16,30,2,30,18,30,0,30,14,0,0]
[17,{"$f":"LOOKUP(A35,[1]PilotReg!$A:$A,[1]PilotReg!$B:$B)","v":"Black-Orange"},{"$f":"LOOKUP(A35,[1]PilotReg!$A:$A,[1]PilotReg!$E:$E)","v":"Chanapa Sermsai"},{"$f":"LOOKUP(A35,[1]PilotReg!$A:$A,[1]PilotReg!$G:$G)","v":"F"},{"$f":"LOOKUP(A35,[1]PilotReg!$A:$A,[1]PilotReg!$F:$F)","v":"Aunza Thailand"},198,27,30,2,30,2,30,2,30,2,30,8,30,2]
[8,{"$f":"LOOKUP(A36,[1]PilotReg!$A:$A,[1]PilotReg!$B:$B)","v":"White"},{"$f":"LOOKUP(A36,[1]PilotReg!$A:$A,[1]PilotReg!$E:$E)","v":"Plaifha Thongdonpum"},{"$f":"LOOKUP(A36,[1]PilotReg!$A:$A,[1]PilotReg!$G:$G)","v":"F"},{"$f":"LOOKUP(A36,[1]PilotReg!$A:$A,[1]PilotReg!$F:$F)","v":"Siam Junior"},197,28,30,9,22,2,30,2,30,2,30,8,30,2]
[22,{"$f":"LOOKUP(A37,[1]PilotReg!$A:$A,[1]PilotReg!$B:$B)","v":"Blue-Grey"},{"$f":"LOOKUP(A37,[1]PilotReg!$A:$A,[1]PilotReg!$E:$E)","v":"Nutchai Dadrung"},{"$f":"LOOKUP(A37,[1]PilotReg!$A:$A,[1]PilotReg!$G:$G)","v":"M"},{"$f":"LOOKUP(A37,[1]PilotReg!$A:$A,[1]PilotReg!$F:$F)","v":"Moobin"},196,29,30,2,30,2,30,0,30,2,30,8,30,2]
[35,{"$f":"LOOKUP(A38,[1]PilotReg!$A:$A,[1]PilotReg!$B:$B)","v":"Green-Red"},{"$f":"LOOKUP(A38,[1]PilotReg!$A:$A,[1]PilotReg!$E:$E)","v":"Kittisak Khamwongpin"},{"$f":"LOOKUP(A38,[1]PilotReg!$A:$A,[1]PilotReg!$G:$G)","v":"M"},{"$f":"LOOKUP(A38,[1]PilotReg!$A:$A,[1]PilotReg!$F:$F)","v":"Doklumduan"},196,29,30,2,30,0,30,7,25,2,30,8,30,2]
[25,{"$f":"LOOKUP(A39,[1]PilotReg!$A:$A,[1]PilotReg!$B:$B)","v":"Red-Yellow"},{"$f":"LOOKUP(A39,[1]PilotReg!$A:$A,[1]PilotReg!$E:$E)","v":"Piyapong Tremsap"},{"$f":"LOOKUP(A39,[1]PilotReg!$A:$A,[1]PilotReg!$G:$G)","v":"M"},{"$f":"LOOKUP(A39,[1]PilotReg!$A:$A,[1]PilotReg!$F:$F)","v":"Ubonratchathani Aero Club"},196,29,25,2,30,2,30,0,30,2,30,13,30,2]
[3,{"$f":"LOOKUP(A40,[1]PilotReg!$A:$A,[1]PilotReg!$B:$B)","v":"Orange-Green"},{"$f":"LOOKUP(A40,[1]PilotReg!$A:$A,[1]PilotReg!$E:$E)","v":"Avasda Chaisorn"},{"$f":"LOOKUP(A40,[1]PilotReg!$A:$A,[1]PilotReg!$G:$G)","v":"F"},{"$f":"LOOKUP(A40,[1]PilotReg!$A:$A,[1]PilotReg!$F:$F)","v":"4st Mahongsorn"},193,32,30,2,30,2,30,2,30,2,25,8,30,2]
[9,{"$f":"LOOKUP(A41,[1]PilotReg!$A:$A,[1]PilotReg!$B:$B)","v":"Blue-White"},{"$f":"LOOKUP(A41,[1]PilotReg!$A:$A,[1]PilotReg!$E:$E)","v":"Paramin Sangkaew"},{"$f":"LOOKUP(A41,[1]PilotReg!$A:$A,[1]PilotReg!$G:$G)","v":"M"},{"$f":"LOOKUP(A41,[1]PilotReg!$A:$A,[1]PilotReg!$F:$F)","v":"Doklumduan"},193,32,30,2,30,2,30,2,30,2,25,8,30,2]
[30,{"$f":"LOOKUP(A42,[1]PilotReg!$A:$A,[1]PilotReg!$B:$B)","v":"Red-White"},{"$f":"LOOKUP(A42,[1]PilotReg!$A:$A,[1]PilotReg!$E:$E)","v":"Pattarin Insornsart"},{"$f":"LOOKUP(A42,[1]PilotReg!$A:$A,[1]PilotReg!$G:$G)","v":"F"},{"$f":"LOOKUP(A42,[1]PilotReg!$A:$A,[1]PilotReg!$F:$F)","v":"4st Mahongsorn"},190,34,30,2,30,2,30,2,30,2,22,8,30,2]
[16,{"$f":"LOOKUP(A43,[1]PilotReg!$A:$A,[1]PilotReg!$B:$B)","v":"Blue-Orange"},{"$f":"LOOKUP(A43,[1]PilotReg!$A:$A,[1]PilotReg!$E:$E)","v":"Jirasak Viteetham"},{"$f":"LOOKUP(A43,[1]PilotReg!$A:$A,[1]PilotReg!$G:$G)","v":"M"},{"$f":"LOOKUP(A43,[1]PilotReg!$A:$A,[1]PilotReg!$F:$F)","v":"Isarn Club"},179,35,30,6,22,5,22,2,20,2,30,8,30,2]
[14,{"$f":"LOOKUP(A44,[1]PilotReg!$A:$A,[1]PilotReg!$B:$B)","v":"Red"},{"$f":"LOOKUP(A44,[1]PilotReg!$A:$A,[1]PilotReg!$E:$E)","v":"Kittipas Boonkoom"},{"$f":"LOOKUP(A44,[1]PilotReg!$A:$A,[1]PilotReg!$G:$G)","v":"M"},{"$f":"LOOKUP(A44,[1]PilotReg!$A:$A,[1]PilotReg!$F:$F)","v":"Doklumduan"},175,36,22,2,25,2,30,2,30,2,25,8,25,2]
[6,{"$f":"LOOKUP(A45,[1]PilotReg!$A:$A,[1]PilotReg!$B:$B)","v":"Orange-White"},{"$f":"LOOKUP(A45,[1]PilotReg!$A:$A,[1]PilotReg!$E:$E)","v":"Suriyon Sungsook"},{"$f":"LOOKUP(A45,[1]PilotReg!$A:$A,[1]PilotReg!$G:$G)","v":"M"},{"$f":"LOOKUP(A45,[1]PilotReg!$A:$A,[1]PilotReg!$F:$F)","v":"4st Mahongsorn"},156,37,30,2,30,2,30,2,30,0,30,0,0,0]
[44,{"$f":"LOOKUP(A46,[1]PilotReg!$A:$A,[1]PilotReg!$B:$B)","v":"Blue-Yellow"},{"$f":"LOOKUP(A46,[1]PilotReg!$A:$A,[1]PilotReg!$E:$E)","v":"Woraphot Khamchomphu"},{"$f":"LOOKUP(A46,[1]PilotReg!$A:$A,[1]PilotReg!$G:$G)","v":"M"},{"$f":"LOOKUP(A46,[1]PilotReg!$A:$A,[1]PilotReg!$F:$F)","v":"Ubonratchathani Aero Club"},154,38,30,5,0,0,30,0,30,2,22,8,25,2]
[40,{"$f":"LOOKUP(A47,[1]PilotReg!$A:$A,[1]PilotReg!$B:$B)","v":"White"},{"$f":"LOOKUP(A47,[1]PilotReg!$A:$A,[1]PilotReg!$E:$E)","v":"Gorbua Yenvaree"},{"$f":"LOOKUP(A47,[1]PilotReg!$A:$A,[1]PilotReg!$G:$G)","v":"F"},{"$f":"LOOKUP(A47,[1]PilotReg!$A:$A,[1]PilotReg!$F:$F)","v":"Aunza Thailand"},142,39,22,2,0,0,30,2,22,2,22,8,30,2]
[1,{"$f":"LOOKUP(A48,[1]PilotReg!$A:$A,[1]PilotReg!$B:$B)","v":"Orange-Blue"},{"$f":"LOOKUP(A48,[1]PilotReg!$A:$A,[1]PilotReg!$E:$E)","v":"Tanaporn Panapho"},{"$f":"LOOKUP(A48,[1]PilotReg!$A:$A,[1]PilotReg!$G:$G)","v":"F"},{"$f":"LOOKUP(A48,[1]PilotReg!$A:$A,[1]PilotReg!$F:$F)","v":"Aunza Thailand"},121,40,22,2,0,0,25,2,30,2,30,8,0,0]
[18,{"$f":"LOOKUP(A49,[1]PilotReg!$A:$A,[1]PilotReg!$B:$B)","v":"Blue-Green"},{"$f":"LOOKUP(A49,[1]PilotReg!$A:$A,[1]PilotReg!$E:$E)","v":"Anuparp Sura"},{"$f":"LOOKUP(A49,[1]PilotReg!$A:$A,[1]PilotReg!$G:$G)","v":"M"},{"$f":"LOOKUP(A49,[1]PilotReg!$A:$A,[1]PilotReg!$F:$F)","v":"Polly Thailand"},94,41,30,2,30,2,0,0,30,0,0,0,0,0]
[28,{"$f":"LOOKUP(A50,[1]PilotReg!$A:$A,[1]PilotReg!$B:$B)","v":"Orange-Red"},{"$f":"LOOKUP(A50,[1]PilotReg!$A:$A,[1]PilotReg!$E:$E)","v":"Puja Laksana"},{"$f":"LOOKUP(A50,[1]PilotReg!$A:$A,[1]PilotReg!$G:$G)","v":"M"},{"$f":"LOOKUP(A50,[1]PilotReg!$A:$A,[1]PilotReg!$F:$F)","v":"Individual"},62,42,30,2,0,0,0,0,30,0,0,0,0,0]
[42,{"$f":"LOOKUP(A51,[1]PilotReg!$A:$A,[1]PilotReg!$B:$B)","v":"Red-Blue"},{"$f":"LOOKUP(A51,[1]PilotReg!$A:$A,[1]PilotReg!$E:$E)","v":"Chanin Chaithaset"},{"$f":"LOOKUP(A51,[1]PilotReg!$A:$A,[1]PilotReg!$G:$G)","v":"M"},{"$f":"LOOKUP(A51,[1]PilotReg!$A:$A,[1]PilotReg!$F:$F)","v":"Isarn Club"},62,42,30,2,0,0,0,0,30,0,0,0,0,0]
[39,{"$f":"LOOKUP(A52,[1]PilotReg!$A:$A,[1]PilotReg!$B:$B)","v":"Blue-Black"},{"$f":"LOOKUP(A52,[1]PilotReg!$A:$A,[1]PilotReg!$E:$E)","v":"Naruporn Wathaya"},{"$f":"LOOKUP(A52,[1]PilotReg!$A:$A,[1]PilotReg!$G:$G)","v":"F"},{"$f":"LOOKUP(A52,[1]PilotReg!$A:$A,[1]PilotReg!$F:$F)","v":"Siam Junior"},52,44,20,2,0,0,0,0,30,0,0,0,0,0]

{"sheet":"IndividualEconomy","index":2,"n_rows":52,"n_cols":9,"rows_kept":52,"cut":false,"hidden":false,"merged":[[7,0,7,6],[1,5,1,6],[1,8,2,8],[5,0,6,0],[5,1,6,1],[5,2,6,2],[5,4,6,4],[5,5,6,5],[5,6,6,6],[5,7,5,8]]}
["Master Score"]
["Individual Economy",null,null,null,null,"Final"]
["Event:","3rd Thailand Paramotor King's Cup Open",null,null,null,"Total No. of Pilots:"]
["Venue:","Nong Kho, Chonburi, Thailand"]
[]
["Wing No. ","Colour","Pilot Name","Gender","Team","Total Score","Rank"]
[null,null,null,null,null,null,null,5,12]
["Automatic Fields. Do not modify manually."]
[21,{"$f":"LOOKUP(A9,[1]PilotReg!$A:$A,[1]PilotReg!$B:$B)","v":"Orange-Blue"},{"$f":"LOOKUP(A9,[1]PilotReg!$A:$A,[1]PilotReg!$E:$E)","v":"Kittiphop Phrommat"},{"$f":"LOOKUP(A9,[1]PilotReg!$A:$A,[1]PilotReg!$G:$G)","v":"M"},{"$f":"LOOKUP(A9,[1]PilotReg!$A:$A,[1]PilotReg!$F:$F)","v":"Mosquito"},{"$f":"SUM(H9:I9)","v":60},{"$f":"RANK(F9,$F:$F)","v":1},30,30]
[12,{"$f":"LOOKUP(A10,[1]PilotReg!$A:$A,[1]PilotReg!$B:$B)","v":"Blue-White"},{"$f":"LOOKUP(A10,[1]PilotReg!$A:$A,[1]PilotReg!$E:$E)","v":"Noppanai Jaisawang"},{"$f":"LOOKUP(A10,[1]PilotReg!$A:$A,[1]PilotReg!$G:$G)","v":"M"},{"$f":"LOOKUP(A10,[1]PilotReg!$A:$A,[1]PilotReg!$F:$F)","v":"Moobin"},44,2,22,22]
[5,{"$f":"LOOKUP(A11,[1]PilotReg!$A:$A,[1]PilotReg!$B:$B)","v":"Red-Orange"},{"$f":"LOOKUP(A11,[1]PilotReg!$A:$A,[1]PilotReg!$E:$E)","v":"Daniel Macak"},{"$f":"LOOKUP(A11,[1]PilotReg!$A:$A,[1]PilotReg!$G:$G)","v":"M"},{"$f":"LOOKUP(A11,[1]PilotReg!$A:$A,[1]PilotReg!$F:$F)","v":"Siam Junior"},42,3,17,25]
[15,{"$f":"LOOKUP(A12,[1]PilotReg!$A:$A,[1]PilotReg!$B:$B)","v":"Blue-White"},{"$f":"LOOKUP(A12,[1]PilotReg!$A:$A,[1]PilotReg!$E:$E)","v":"David Graupera"},{"$f":"LOOKUP(A12,[1]PilotReg!$A:$A,[1]PilotReg!$G:$G)","v":"M"},{"$f":"LOOKUP(A12,[1]PilotReg!$A:$A,[1]PilotReg!$F:$F)","v":"Isarn Club"},41,4,19,22]
[19,{"$f":"LOOKUP(A13,[1]PilotReg!$A:$A,[1]PilotReg!$B:$B)","v":"Blue-Green"},{"$f":"LOOKUP(A13,[1]PilotReg!$A:$A,[1]PilotReg!$E:$E)","v":"Phrompiriya Tapeanthong"},{"$f":"LOOKUP(A13,[1]PilotReg!$A:$A,[1]PilotReg!$G:$G)","v":"M"},{"$f":"LOOKUP(A13,[1]PilotReg!$A:$A,[1]PilotReg!$F:$F)","v":"Mosquito"},35,5,16,19]
[26,{"$f":"LOOKUP(A14,[1]PilotReg!$A:$A,[1]PilotReg!$B:$B)","v":"Red-Grey"},{"$f":"LOOKUP(A14,[1]PilotReg!$A:$A,[1]PilotReg!$E:$E)","v":"Pinit Kingtong"},{"$f":"LOOKUP(A14,[1]PilotReg!$A:$A,[1]PilotReg!$G:$G)","v":"M"},{"$f":"LOOKUP(A14,[1]PilotReg!$A:$A,[1]PilotReg!$F:$F)","v":"Moobin"},34,6,15,19]
[37,{"$f":"LOOKUP(A15,[1]PilotReg!$A:$A,[1]PilotReg!$B:$B)","v":"Grey-Red"},{"$f":"LOOKUP(A15,[1]PilotReg!$A:$A,[1]PilotReg!$E:$E)","v":"Sirichok Putaworn"},{"$f":"LOOKUP(A15,[1]PilotReg!$A:$A,[1]PilotReg!$G:$G)","v":"M"},{"$f":"LOOKUP(A15,[1]PilotReg!$A:$A,[1]PilotReg!$F:$F)","v":"Individual"},30,7,13,17]
[23,{"$f":"LOOKUP(A16,[1]PilotReg!$A:$A,[1]PilotReg!$B:$B)","v":"Black-Blue"},{"$f":"LOOKUP(A16,[1]PilotReg!$A:$A,[1]PilotReg!$E:$E)","v":"Prakit Binkaew"},{"$f":"LOOKUP(A16,[1]PilotReg!$A:$A,[1]PilotReg!$G:$G)","v":"M"},{"$f":"LOOKUP(A16,[1]PilotReg!$A:$A,[1]PilotReg!$F:$F)","v":"Individual"},28,8,12,16]
[45,{"$f":"LOOKUP(A17,[1]PilotReg!$A:$A,[1]PilotReg!$B:$B)","v":"Blue-Red"},{"$f":"LOOKUP(A17,[1]PilotReg!$A:$A,[1]PilotReg!$E:$E)","v":"Jiangsak Puangpee"},{"$f":"LOOKUP(A17,[1]PilotReg!$A:$A,[1]PilotReg!$G:$G)","v":"M"},{"$f":"LOOKUP(A17,[1]PilotReg!$A:$A,[1]PilotReg!$F:$F)","v":"Doklumduan"},27,9,14,13]
[30,{"$f":"LOOKUP(A18,[1]PilotReg!$A:$A,[1]PilotReg!$B:$B)","v":"Red-White"},{"$f":"LOOKUP(A18,[1]PilotReg!$A:$A,[1]PilotReg!$E:$E)","v":"Pattarin Insornsart"},{"$f":"LOOKUP(A18,[1]PilotReg!$A:$A,[1]PilotReg!$G:$G)","v":"F"},{"$f":"LOOKUP(A18,[1]PilotReg!$A:$A,[1]PilotReg!$F:$F)","v":"4st Mahongsorn"},27,9,25,2]
[29,{"$f":"LOOKUP(A19,[1]PilotReg!$A:$A,[1]PilotReg!$B:$B)","v":"Orange-Grey"},{"$f":"LOOKUP(A19,[1]PilotReg!$A:$A,[1]PilotReg!$E:$E)","v":"Pongnarin Somboon"},{"$f":"LOOKUP(A19,[1]PilotReg!$A:$A,[1]PilotReg!$G:$G)","v":"M"},{"$f":"LOOKUP(A19,[1]PilotReg!$A:$A,[1]PilotReg!$F:$F)","v":"Siam Junior"},23,11,10,13]
[32,{"$f":"LOOKUP(A20,[1]PilotReg!$A:$A,[1]PilotReg!$B:$B)","v":"Red-White"},{"$f":"LOOKUP(A20,[1]PilotReg!$A:$A,[1]PilotReg!$E:$E)","v":"Saman Promnaree"},{"$f":"LOOKUP(A20,[1]PilotReg!$A:$A,[1]PilotReg!$G:$G)","v":"M"},{"$f":"LOOKUP(A20,[1]PilotReg!$A:$A,[1]PilotReg!$F:$F)","v":"Mosquito"},23,11,8,15]
[40,{"$f":"LOOKUP(A21,[1]PilotReg!$A:$A,[1]PilotReg!$B:$B)","v":"White"},{"$f":"LOOKUP(A21,[1]PilotReg!$A:$A,[1]PilotReg!$E:$E)","v":"Gorbua Yenvaree"},{"$f":"LOOKUP(A21,[1]PilotReg!$A:$A,[1]PilotReg!$G:$G)","v":"F"},{"$f":"LOOKUP(A21,[1]PilotReg!$A:$A,[1]PilotReg!$F:$F)","v":"Aunza Thailand"},22,13,20,2]
[2,{"$f":"LOOKUP(A22,[1]PilotReg!$A:$A,[1]PilotReg!$B:$B)","v":"Red-Orange"},{"$f":"LOOKUP(A22,[1]PilotReg!$A:$A,[1]PilotReg!$E:$E)","v":"Aroonrat Jongonklang"},{"$f":"LOOKUP(A22,[1]PilotReg!$A:$A,[1]PilotReg!$G:$G)","v":"F"},{"$f":"LOOKUP(A22,[1]PilotReg!$A:$A,[1]PilotReg!$F:$F)","v":"Polly Thailand"},20,14,18,2]
[36,{"$f":"LOOKUP(A23,[1]PilotReg!$A:$A,[1]PilotReg!$B:$B)","v":"Orange-Blue"},{"$f":"LOOKUP(A23,[1]PilotReg!$A:$A,[1]PilotReg!$E:$E)","v":"Chayaphong Pothipuk"},{"$f":"LOOKUP(A23,[1]PilotReg!$A:$A,[1]PilotReg!$G:$G)","v":"M"},{"$f":"LOOKUP(A23,[1]PilotReg!$A:$A,[1]PilotReg!$F:$F)","v":"Polly Thailand"},16,15,2,14]
[7,{"$f":"LOOKUP(A24,[1]PilotReg!$A:$A,[1]PilotReg!$B:$B)","v":"Red-Black"},{"$f":"LOOKUP(A24,[1]PilotReg!$A:$A,[1]PilotReg!$E:$E)","v":"Kerkrit Meunphukiew"},{"$f":"LOOKUP(A24,[1]PilotReg!$A:$A,[1]PilotReg!$G:$G)","v":"M"},{"$f":"LOOKUP(A24,[1]PilotReg!$A:$A,[1]PilotReg!$F:$F)","v":"Mosquito"},16,15,7,9]
[34,{"$f":"LOOKUP(A25,[1]PilotReg!$A:$A,[1]PilotReg!$B:$B)","v":"Red-Grey"},{"$f":"LOOKUP(A25,[1]PilotReg!$A:$A,[1]PilotReg!$E:$E)","v":"Panupong Tipayachan"},{"$f":"LOOKUP(A25,[1]PilotReg!$A:$A,[1]PilotReg!$G:$G)","v":"M"},{"$f":"LOOKUP(A25,[1]PilotReg!$A:$A,[1]PilotReg!$F:$F)","v":"Aunza Thailand"},15,17,2,13]
[10,{"$f":"LOOKUP(A26,[1]PilotReg!$A:$A,[1]PilotReg!$B:$B)","v":"Orange-Blue"},{"$f":"LOOKUP(A26,[1]PilotReg!$A:$A,[1]PilotReg!$E:$E)","v":"Noparat Intharaumnuay"},{"$f":"LOOKUP(A26,[1]PilotReg!$A:$A,[1]PilotReg!$G:$G)","v":"M"},{"$f":"LOOKUP(A26,[1]PilotReg!$A:$A,[1]PilotReg!$F:$F)","v":"Mosquito"},15,17,2,13]
[20,{"$f":"LOOKUP(A27,[1]PilotReg!$A:$A,[1]PilotReg!$B:$B)","v":"Purple-Orange"},{"$f":"LOOKUP(A27,[1]PilotReg!$A:$A,[1]PilotReg!$E:$E)","v":"Somponk Busabonk"},{"$f":"LOOKUP(A27,[1]PilotReg!$A:$A,[1]PilotReg!$G:$G)","v":"M"},{"$f":"LOOKUP(A27,[1]PilotReg!$A:$A,[1]PilotReg!$F:$F)","v":"Moobin"},11,19,2,9]
[22,{"$f":"LOOKUP(A28,[1]PilotReg!$A:$A,[1]PilotReg!$B:$B)","v":"Blue-Grey"},{"$f":"LOOKUP(A28,[1]PilotReg!$A:$A,[1]PilotReg!$E:$E)","v":"Nutchai Dadrung"},{"$f":"LOOKUP(A28,[1]PilotReg!$A:$A,[1]PilotReg!$G:$G)","v":"M"},{"$f":"LOOKUP(A28,[1]PilotReg!$A:$A,[1]PilotReg!$F:$F)","v":"Moobin"},11,19,2,9]
[3,{"$f":"LOOKUP(A29,[1]PilotReg!$A:$A,[1]PilotReg!$B:$B)","v":"Orange-Green"},{"$f":"LOOKUP(A29,[1]PilotReg!$A:$A,[1]PilotReg!$E:$E)","v":"Avasda Chaisorn"},{"$f":"LOOKUP(A29,[1]PilotReg!$A:$A,[1]PilotReg!$G:$G)","v":"F"},{"$f":"LOOKUP(A29,[1]PilotReg!$A:$A,[1]PilotReg!$F:$F)","v":"4st Mahongsorn"},11,19,9,2]
[6,{"$f":"LOOKUP(A30,[1]PilotReg!$A:$A,[1]PilotReg!$B:$B)","v":"Orange-White"},{"$f":"LOOKUP(A30,[1]PilotReg!$A:$A,[1]PilotReg!$E:$E)","v":"Suriyon Sungsook"},{"$f":"LOOKUP(A30,[1]PilotReg!$A:$A,[1]PilotReg!$G:$G)","v":"M"},{"$f":"LOOKUP(A30,[1]PilotReg!$A:$A,[1]PilotReg!$F:$F)","v":"4st Mahongsorn"},11,19,11,0]
[27,{"$f":"LOOKUP(A31,[1]PilotReg!$A:$A,[1]PilotReg!$B:$B)","v":"Black-Grey"},{"$f":"LOOKUP(A31,[1]PilotReg!$A:$A,[1]PilotReg!$E:$E)","v":"Nipon Somsri"},{"$f":"LOOKUP(A31,[1]PilotReg!$A:$A,[1]PilotReg!$G:$G)","v":"M"},{"$f":"LOOKUP(A31,[1]PilotReg!$A:$A,[1]PilotReg!$F:$F)","v":"Isarn Club"},8,23,2,6]
[1,{"$f":"LOOKUP(A32,[1]PilotReg!$A:$A,[1]PilotReg!$B:$B)","v":"Orange-Blue"},{"$f":"LOOKUP(A32,[1]PilotReg!$A:$A,[1]PilotReg!$E:$E)","v":"Tanaporn Panapho"},{"$f":"LOOKUP(A32,[1]PilotReg!$A:$A,[1]PilotReg!$G:$G)","v":"F"},{"$f":"LOOKUP(A32,[1]PilotReg!$A:$A,[1]PilotReg!$F:$F)","v":"Aunza Thailand"},8,23,6,2]
[33,{"$f":"LOOKUP(A33,[1]PilotReg!$A:$A,[1]PilotReg!$B:$B)","v":"Black-Yellow"},{"$f":"LOOKUP(A33,[1]PilotReg!$A:$A,[1]PilotReg!$E:$E)","v":"Pongkorn Thanasakulkornsaeng"},{"$f":"LOOKUP(A33,[1]PilotReg!$A:$A,[1]PilotReg!$G:$G)","v":"M"},{"$f":"LOOKUP(A33,[1]PilotReg!$A:$A,[1]PilotReg!$F:$F)","v":"Polly Thailand"},7,25,2,5]
[31,{"$f":"LOOKUP(A34,[1]PilotReg!$A:$A,[1]PilotReg!$B:$B)","v":"Yellow-Red"},{"$f":"LOOKUP(A34,[1]PilotReg!$A:$A,[1]PilotReg!$E:$E)","v":"Pongparn Supasorn"},{"$f":"LOOKUP(A34,[1]PilotReg!$A:$A,[1]PilotReg!$G:$G)","v":"M"},{"$f":"LOOKUP(A34,[1]PilotReg!$A:$A,[1]PilotReg!$F:$F)","v":"Ubonratchathani Aero Club"},7,25,5,2]
[8,{"$f":"LOOKUP(A35,[1]PilotReg!$A:$A,[1]PilotReg!$B:$B)","v":"White"},{"$f":"LOOKUP(A35,[1]PilotReg!$A:$A,[1]PilotReg!$E:$E)","v":"Plaifha Thongdonpum"},{"$f":"LOOKUP(A35,[1]PilotReg!$A:$A,[1]PilotReg!$G:$G)","v":"F"},{"$f":"LOOKUP(A35,[1]PilotReg!$A:$A,[1]PilotReg!$F:$F)","v":"Siam Junior"},6,27,4,2]
[11,{"$f":"LOOKUP(A36,[1]PilotReg!$A:$A,[1]PilotReg!$B:$B)","v":"Red-Blk-White"},{"$f":"LOOKUP(A36,[1]PilotReg!$A:$A,[1]PilotReg!$E:$E)","v":"Soratat Thongsub"},{"$f":"LOOKUP(A36,[1]PilotReg!$A:$A,[1]PilotReg!$G:$G)","v":"M"},{"$f":"LOOKUP(A36,[1]PilotReg!$A:$A,[1]PilotReg!$F:$F)","v":"Doklumduan"},5,28,2,3]
[43,{"$f":"LOOKUP(A37,[1]PilotReg!$A:$A,[1]PilotReg!$B:$B)","v":"Yellow-White"},{"$f":"LOOKUP(A37,[1]PilotReg!$A:$A,[1]PilotReg!$E:$E)","v":"A  Aongard"},{"$f":"LOOKUP(A37,[1]PilotReg!$A:$A,[1]PilotReg!$G:$G)","v":"M"},{"$f":"LOOKUP(A37,[1]PilotReg!$A:$A,[1]PilotReg!$F:$F)","v":"Siam Junior"},5,28,2,3]
[35,{"$f":"LOOKUP(A38,[1]PilotReg!$A:$A,[1]PilotReg!$B:$B)","v":"Green-Red"},{"$f":"LOOKUP(A38,[1]PilotReg!$A:$A,[1]PilotReg!$E:$E)","v":"Kittisak Khamwongpin"},{"$f":"LOOKUP(A38,[1]PilotReg!$A:$A,[1]PilotReg!$G:$G)","v":"M"},{"$f":"LOOKUP(A38,[1]PilotReg!$A:$A,[1]PilotReg!$F:$F)","v":"Doklumduan"},5,28,3,2]
[16,{"$f":"LOOKUP(A39,[1]PilotReg!$A:$A,[1]PilotReg!$B:$B)","v":"Blue-Orange"},{"$f":"LOOKUP(A39,[1]PilotReg!$A:$A,[1]PilotReg!$E:$E)","v":"Jirasak Viteetham"},{"$f":"LOOKUP(A39,[1]PilotReg!$A:$A,[1]PilotReg!$G:$G)","v":"M"},{"$f":"LOOKUP(A39,[1]PilotReg!$A:$A,[1]PilotReg!$F:$F)","v":"Isarn Club"},5,28,2,3]
[48,{"$f":"LOOKUP(A40,[1]PilotReg!$A:$A,[1]PilotReg!$B:$B)","v":"Green-Yellow"},{"$f":"LOOKUP(A40,[1]PilotReg!$A:$A,[1]PilotReg!$E:$E)","v":"Nut Thanaphuthiphong"},{"$f":"LOOKUP(A40,[1]PilotReg!$A:$A,[1]PilotReg!$G:$G)","v":"M"},{"$f":"LOOKUP(A40,[1]PilotReg!$A:$A,[1]PilotReg!$F:$F)","v":"Individual"},4,32,2,2]
[13,{"$f":"LOOKUP(A41,[1]PilotReg!$A:$A,[1]PilotReg!$B:$B)","v":"Black-Green"},{"$f":"LOOKUP(A41,[1]PilotReg!$A:$A,[1]PilotReg!$E:$E)","v":"Yuttaphol Anantawichain"},{"$f":"LOOKUP(A41,[1]PilotReg!$A:$A,[1]PilotReg!$G:$G)","v":"M"},{"$f":"LOOKUP(A41,[1]PilotReg!$A:$A,[1]PilotReg!$F:$F)","v":"4st Mahongsorn"},4,32,2,2]
[38,{"$f":"LOOKUP(A42,[1]PilotReg!$A:$A,[1]PilotReg!$B:$B)","v":"Black-White"},{"$f":"LOOKUP(A42,[1]PilotReg!$A:$A,[1]PilotReg!$E:$E)","v":"Chaiyapin Chaininwan"},{"$f":"LOOKUP(A42,[1]PilotReg!$A:$A,[1]PilotReg!$G:$G)","v":"M"},{"$f":"LOOKUP(A42,[1]PilotReg!$A:$A,[1]PilotReg!$F:$F)","v":"Isarn Club"},4,32,2,2]
[17,{"$f":"LOOKUP(A43,[1]PilotReg!$A:$A,[1]PilotReg!$B:$B)","v":"Black-Orange"},{"$f":"LOOKUP(A43,[1]PilotReg!$A:$A,[1]PilotReg!$E:$E)","v":"Chanapa Sermsai"},{"$f":"LOOKUP(A43,[1]PilotReg!$A:$A,[1]PilotReg!$G:$G)","v":"F"},{"$f":"LOOKUP(A43,[1]PilotReg!$A:$A,[1]PilotReg!$F:$F)","v":"Aunza Thailand"},4,32,2,2]
[25,{"$f":"LOOKUP(A44,[1]PilotReg!$A:$A,[1]PilotReg!$B:$B)","v":"Red-Yellow"},{"$f":"LOOKUP(A44,[1]PilotReg!$A:$A,[1]PilotReg!$E:$E)","v":"Piyapong Tremsap"},{"$f":"LOOKUP(A44,[1]PilotReg!$A:$A,[1]PilotReg!$G:$G)","v":"M"},{"$f":"LOOKUP(A44,[1]PilotReg!$A:$A,[1]PilotReg!$F:$F)","v":"Ubonratchathani Aero Club"},4,32,2,2]
[9,{"$f":"LOOKUP(A45,[1]PilotReg!$A:$A,[1]PilotReg!$B:$B)","v":"Blue-White"},{"$f":"LOOKUP(A45,[1]PilotReg!$A:$A,[1]PilotReg!$E:$E)","v":"Paramin Sangkaew"},{"$f":"LOOKUP(A45,[1]PilotReg!$A:$A,[1]PilotReg!$G:$G)","v":"M"},{"$f":"LOOKUP(A45,[1]PilotReg!$A:$A,[1]PilotReg!$F:$F)","v":"Doklumduan"},4,32,2,2]
[44,{"$f":"LOOKUP(A46,[1]PilotReg!$A:$A,[1]PilotReg!$B:$B)","v":"Blue-Yellow"},{"$f":"LOOKUP(A46,[1]PilotReg!$A:$A,[1]PilotReg!$E:$E)","v":"Woraphot Khamchomphu"},{"$f":"LOOKUP(A46,[1]PilotReg!$A:$A,[1]PilotReg!$G:$G)","v":"M"},{"$f":"LOOKUP(A46,[1]PilotReg!$A:$A,[1]PilotReg!$F:$F)","v":"Ubonratchathani Aero Club"},4,32,2,2]
[4,{"$f":"LOOKUP(A47,[1]PilotReg!$A:$A,[1]PilotReg!$B:$B)","v":"Blue-Red"},{"$f":"LOOKUP(A47,[1]PilotReg!$A:$A,[1]PilotReg!$E:$E)","v":"Chakrit Babphan"},{"$f":"LOOKUP(A47,[1]PilotReg!$A:$A,[1]PilotReg!$G:$G)","v":"M"},{"$f":"LOOKUP(A47,[1]PilotReg!$A:$A,[1]PilotReg!$F:$F)","v":"Moobin"},2,39,2,0]
[14,{"$f":"LOOKUP(A48,[1]PilotReg!$A:$A,[1]PilotReg!$B:$B)","v":"Red"},{"$f":"LOOKUP(A48,[1]PilotReg!$A:$A,[1]PilotReg!$E:$E)","v":"Kittipas Boonkoom"},{"$f":"LOOKUP(A48,[1]PilotReg!$A:$A,[1]PilotReg!$G:$G)","v":"M"},{"$f":"LOOKUP(A48,[1]PilotReg!$A:$A,[1]PilotReg!$F:$F)","v":"Doklumduan"},2,39,2,0]
[39,{"$f":"LOOKUP(A49,[1]PilotReg!$A:$A,[1]PilotReg!$B:$B)","v":"Blue-Black"},{"$f":"LOOKUP(A49,[1]PilotReg!$A:$A,[1]PilotReg!$E:$E)","v":"Naruporn Wathaya"},{"$f":"LOOKUP(A49,[1]PilotReg!$A:$A,[1]PilotReg!$G:$G)","v":"F"},{"$f":"LOOKUP(A49,[1]PilotReg!$A:$A,[1]PilotReg!$F:$F)","v":"Siam Junior"},2,39,0,2]
[18,{"$f":"LOOKUP(A50,[1]PilotReg!$A:$A,[1]PilotReg!$B:$B)","v":"Blue-Green"},{"$f":"LOOKUP(A50,[1]PilotReg!$A:$A,[1]PilotReg!$E:$E)","v":"Anuparp Sura"},{"$f":"LOOKUP(A50,[1]PilotReg!$A:$A,[1]PilotReg!$G:$G)","v":"M"},{"$f":"LOOKUP(A50,[1]PilotReg!$A:$A,[1]PilotReg!$F:$F)","v":"Polly Thailand"},0,42,0,0]
[28,{"$f":"LOOKUP(A51,[1]PilotReg!$A:$A,[1]PilotReg!$B:$B)","v":"Orange-Red"},{"$f":"LOOKUP(A51,[1]PilotReg!$A:$A,[1]PilotReg!$E:$E)","v":"Puja Laksana"},{"$f":"LOOKUP(A51,[1]PilotReg!$A:$A,[1]PilotReg!$G:$G)","v":"M"},{"$f":"LOOKUP(A51,[1]PilotReg!$A:$A,[1]PilotReg!$F:$F)","v":"Individual"},0,42,0,0]
[42,{"$f":"LOOKUP(A52,[1]PilotReg!$A:$A,[1]PilotReg!$B:$B)","v":"Red-Blue"},{"$f":"LOOKUP(A52,[1]PilotReg!$A:$A,[1]PilotReg!$E:$E)","v":"Chanin Chaithaset"},{"$f":"LOOKUP(A52,[1]PilotReg!$A:$A,[1]PilotReg!$G:$G)","v":"M"},{"$f":"LOOKUP(A52,[1]PilotReg!$A:$A,[1]PilotReg!$F:$F)","v":"Isarn Club"},0,42,0,0]

{"sheet":"TeamCombined","index":3,"n_rows":60,"n_cols":6,"rows_kept":60,"cut":false,"hidden":false,"merged":[]}
[]
[]
["Row Labels","Sum of Total Score"]
["Mosquito",1547]
["Kerkrit Meunphukiew",285]
["Kittiphop Phrommat",379,null,"Event: 3rd Thailand Paramotor King's Cup Open"]
["Noparat Intharaumnuay",279,null,"Venue: Nong Kho, Chonburi, Thailand"]
["Phrompiriya Tapeanthong",331,null,"Team Combined",null,"Final"]
["Saman Promnaree",273,null,"Team","Sum of Top 3","Rank"]
["Moobin",1201,null,"Mosquito",{"$f":"SUM(LARGE($B$5:$B$9,{1,2,3}))","v":995},{"$f":"RANK(E10,$E$10:$E$18)","v":1}]
["Chakrit Babphan",209,null,"Siam Junior",{"$f":"SUM(LARGE($B$17:$B$21,{1,2,3}))","v":827},2]
["Noppanai Jaisawang",295,null,"Polly Thailand",{"$f":"SUM(LARGE($B$35:$B$38,{1,2,3}))","v":794},3]
["Nutchai Dadrung",207,null,"Moobin",{"$f":"SUM(LARGE($B$11:$B$15,{1,2,3}))","v":785},4]
["Pinit Kingtong",269,null,"Isarn Club",{"$f":"SUM(LARGE($B$29:$B$33,{1,2,3}))","v":728},5]
["Somponk Busabonk",221,null,"Doklumduan",{"$f":"SUM(LARGE($B$23:$B$27,{1,2,3}))","v":670},6]
["Siam Junior",1084,null,"4st Mahongsorn",{"$f":"SUM(LARGE($B$40:$B$43,{1,2,3}))","v":664},7]
["A  Aongard",205,null,"Aunza Thailand",{"$f":"SUM(LARGE(B50:B53,{1,2,3}))","v":654},8]
["Daniel Macak",318,null,"Ubonratchathani Aero Club",{"$f":"SUM(LARGE($B$55:$B$57,{1,2,3}))","v":573},9]
["Naruporn Wathaya",54]
["Plaifha Thongdonpum",203]
["Pongnarin Somboon",304]
["Doklumduan",1044]
["Jiangsak Puangpee",264]
["Kittipas Boonkoom",177]
["Kittisak Khamwongpin",201]
["Paramin Sangkaew",197]
["Soratat Thongsub",205]
["Isarn Club",974]
["Chaiyapin Chaininwan",219]
["Chanin Chaithaset",62]
["David Graupera",298]
["Jirasak Viteetham",184]
["Nipon Somsri",211]
["Polly Thailand",888]
["Anuparp Sura",94]
["Aroonrat Jongonklang",228]
["Chayaphong Pothipuk",301]
["Pongkorn Thanasakulkornsaeng",265]
["4st Mahongsorn",831]
["Avasda Chaisorn",204]
["Pattarin Insornsart",217]
["Suriyon Sungsook",167]
["Yuttaphol Anantawichain",243]
["Individual",810]
["Nut Thanaphuthiphong",246]
["Prakit Binkaew",256]
["Puja Laksana",62]
["Sirichok Putaworn",246]
["Aunza Thailand",783]
["Chanapa Sermsai",202]
["Gorbua Yenvaree",164]
["Panupong Tipayachan",288]
["Tanaporn Panapho",129]
["Ubonratchathani Aero Club",573]
["Piyapong Tremsap",200]
["Pongparn Supasorn",215]
["Woraphot Khamchomphu",158]
["(blank)"]
["(blank)"]
["Grand Total",9735]