{"text_format":"1","workbook":"xlsx","n_sheets":4,"sheets":["IndividualCombined","IndividualPrecision","IndividualEconomy","TeamCombined"],"not_rendered":{"charts":0,"images":0,"macros":1,"external_links":1,"defined_names":0,"comments":0,"pivot_tables":1},"unopened":[],"bounds":{"document_bytes":16777216,"sheet_cells":100000,"rows_first":2000,"rows_last":500,"rows_between":2000,"halvings":0,"cell_chars":16384,"cell_head_chars":4096},"cells_cut":0,"cells_raw":0,"read":"whole","date_system":"1900"}

{"sheet":"IndividualCombined","index":0,"n_rows":52,"n_cols":21,"rows_kept":52,"cut":false,"hidden":false,"merged":[[1,16,2,18],[7,0,7,6],[5,4,6,4],[5,7,5,20],[5,0,6,0],[5,1,6,1],[5,2,6,2],[5,5,6,5],[5,6,6,6]]}
["Master Score"]
["Individual Combined",null,null,null,null,null,null,null,null,null,null,null,null,null,null,null,"Final"]
["Event:","3rd Thailand Paramotor King's Cup Open",null,null,null,"Total No. of Pilots:",null,{"$f":"[1]PilotReg!$F$2","v":44}]
["Venue:","Nong Kho, Chonburi, Thailand"]
[]
["Wing No. ","Colour","Pilot Name","Gender","Team","Total Score","Rank","Task Score"]
[null,null,null,null,null,null,null,1,2,3,4,5,6,7,8,9,10,11,12,13,14]
["Automatic Fields. Do not modify manually."]
[21,{"$f":"LOOKUP(A9,[1]PilotReg!$A:$A,[1]PilotReg!$B:$B)","v":"Orange-Blue"},{"$f":"LOOKUP(A9,[1]PilotReg!$A:$A,[1]PilotReg!$E:$E)","v":"Kittiphop Phrommat"},{"$f":"LOOKUP(A9,[1]PilotReg!$A:$A,[1]PilotReg!$G:$G)","v":"M"},{"$f":"LOOKUP(A9,[1]PilotReg!$A:$A,[1]PilotReg!$F:$F)","v":"Mosquito"},{"$f":"SUM(H9:U9)","v":379},{"$f":"RANK(F9,$F:$F)","v":1},30,19,30,30,30,30,19,30,30,30,16,30,30,25]
[19,{"$f":"LOOKUP(A10,[1]PilotReg!$A:$A,[1]PilotReg!$B:$B)","v":"Blue-Green"},{"$f":"LOOKUP(A10,[1]PilotReg!$A:$A,[1]PilotReg!$E:$E)","v":"Phrompiriya Tapeanthong"},{"$f":"LOOKUP(A10,[1]PilotReg!$A:$A,[1]PilotReg!$G:$G)","v":"M"},{"$f":"LOOKUP(A10,[1]PilotReg!$A:$A,[1]PilotReg!$F:$F)","v":"Mosquito"},331,2,30,20,30,19,16,30,30,30,17,30,19,19,25,16]
[5,{"$f":"LOOKUP(A11,[1]PilotReg!$A:$A,[1]PilotReg!$B:$B)","v":"Red-Orange"},{"$f":"LOOKUP(A11,[1]PilotReg!$A:$A,[1]PilotReg!$E:$E)","v":"Daniel Macak"},{"$f":"LOOKUP(A11,[1]PilotReg!$A:$A,[1]PilotReg!$G:$G)","v":"M"},{"$f":"LOOKUP(A11,[1]PilotReg!$A:$A,[1]PilotReg!$F:$F)","v":"Siam Junior"},318,3,30,18,30,18,17,30,7,30,20,30,15,25,30,18]
[29,{"$f":"LOOKUP(A12,[1]PilotReg!$A:$A,[1]PilotReg!$B:$B)","v":"Orange-Grey"},{"$f":"LOOKUP(A12,[1]PilotReg!$A:$A,[1]PilotReg!$E:$E)","v":"Pongnarin Somboon"},{"$f":"LOOKUP(A12,[1]PilotReg!$A:$A,[1]PilotReg!$G:$G)","v":"M"},{"$f":"LOOKUP(A12,[1]PilotReg!$A:$A,[1]PilotReg!$F:$F)","v":"Siam Junior"},304,4,30,30,30,17,10,30,10,25,19,30,22,13,30,8]
[36,{"$f":"LOOKUP(A13,[1]PilotReg!$A:$A,[1]PilotReg!$B:$B)","v":"Orange-Blue"},{"$f":"LOOKUP(A13,[1]PilotReg!$A:$A,[1]PilotReg!$E:$E)","v":"Chayaphong Pothipuk"},{"$f":"LOOKUP(A13,[1]PilotReg!$A:$A,[1]PilotReg!$G:$G)","v":"M"},{"$f":"LOOKUP(A13,[1]PilotReg!$A:$A,[1]PilotReg!$F:$F)","v":"Polly Thailand"},301,5,30,3,30,25,2,30,20,30,18,30,25,14,30,14]
[15,{"$f":"LOOKUP(A14,[1]PilotReg!$A:$A,[1]PilotReg!$B:$B)","v":"Blue-White"},{"$f":"LOOKUP(A14,[1]PilotReg!$A:$A,[1]PilotReg!$E:$E)","v":"David Graupera"},{"$f":"LOOKUP(A14,[1]PilotReg!$A:$A,[1]PilotReg!$G:$G)","v":"M"},{"$f":"LOOKUP(A14,[1]PilotReg!$A:$A,[1]PilotReg!$F:$F)","v":"Isarn Club"},298,6,30,2,30,14,19,25,16,30,15,30,18,22,30,17]
[12,{"$f":"LOOKUP(A15,[1]PilotReg!$A:$A,[1]PilotReg!$B:$B)","v":"Blue-White"},{"$f":"LOOKUP(A15,[1]PilotReg!$A:$A,[1]PilotReg!$E:$E)","v":"Noppanai Jaisawang"},{"$f":"LOOKUP(A15,[1]PilotReg!$A:$A,[1]PilotReg!$G:$G)","v":"M"},{"$f":"LOOKUP(A15,[1]PilotReg!$A:$A,[1]PilotReg!$F:$F)","v":"Moobin"},295,7,30,17,30,9,22,30,14,30,11,30,8,22,30,12]
[34,{"$f":"LOOKUP(A16,[1]PilotReg!$A:$A,[1]PilotReg!$B:$B)","v":"Red-Grey"},{"$f":"LOOKUP(A16,[1]PilotReg!$A:$A,[1]PilotReg!$E:$E)","v":"Panupong Tipayachan"},{"$f":"LOOKUP(A16,[1]PilotReg!$A:$A,[1]PilotReg!$G:$G)","v":"M"},{"$f":"LOOKUP(A16,[1]PilotReg!$A:$A,[1]PilotReg!$F:$F)","v":"Aunza Thailand"},288,8,30,2,30,20,2,30,9,30,22,30,10,13,30,30]
[7,{"$f":"LOOKUP(A17,[1]PilotReg!$A:$A,[1]PilotReg!$B:$B)","v":"Red-Black"},{"$f":"LOOKUP(A17,[1]PilotReg!$A:$A,[1]PilotReg!$E:$E)","v":"Kerkrit Meunphukiew"},{"$f":"LOOKUP(A17,[1]PilotReg!$A:$A,[1]PilotReg!$G:$G)","v":"M"},{"$f":"LOOKUP(A17,[1]PilotReg!$A:$A,[1]PilotReg!$F:$F)","v":"Mosquito"},285,9,30,22,30,7,7,30,25,30,12,25,8,9,30,20]
[10,{"$f":"LOOKUP(A18,[1]PilotReg!$A:$A,[1]PilotReg!$B:$B)","v":"Orange-Blue"},{"$f":"LOOKUP(A18,[1]PilotReg!$A:$A,[1]PilotReg!$E:$E)","v":"Noparat Intharaumnuay"},{"$f":"LOOKUP(A18,[1]PilotReg!$A:$A,[1]PilotReg!$G:$G)","v":"M"},{"$f":"LOOKUP(A18,[1]PilotReg!$A:$A,[1]PilotReg!$F:$F)","v":"Mosquito"},279,10,30,10,30,16,2,30,22,30,13,30,8,13,30,15]
[32,{"$f":"LOOKUP(A19,[1]PilotReg!$A:$A,[1]PilotReg!$B:$B)","v":"Red-White"},{"$f":"LOOKUP(A19,[1]PilotReg!$A:$A,[1]PilotReg!$E:$E)","v":"Saman Promnaree"},{"$f":"LOOKUP(A19,[1]PilotReg!$A:$A,[1]PilotReg!$G:$G)","v":"M"},{"$f":"LOOKUP(A19,[1]PilotReg!$A:$A,[1]PilotReg!$F:$F)","v":"Mosquito"},273,11,25,2,30,15,8,30,15,30,9,25,17,15,30,22]
[26,{"$f":"LOOKUP(A20,[1]PilotReg!$A:$A,[1]PilotReg!$B:$B)","v":"Red-Grey"},{"$f":"LOOKUP(A20,[1]PilotReg!$A:$A,[1]PilotReg!$E:$E)","v":"Pinit Kingtong"},{"$f":"LOOKUP(A20,[1]PilotReg!$A:$A,[1]PilotReg!$G:$G)","v":"M"},{"$f":"LOOKUP(A20,[1]PilotReg!$A:$A,[1]PilotReg!$F:$F)","v":"Moobin"},269,12,25,14,30,12,15,30,9,30,14,30,8,19,30,3]
{"$rows_left_out":33}
{"sheet":"IndividualPrecision","index":1,"n_rows":52,"n_cols":19,"rows_kept":52,"cut":false,"hidden":false,"merged":[[7,0,7,6],[1,14,2,16],[5,0,6,0],[5,1,6,1],[5,2,6,2],[5,4,6,4],[5,5,6,5],[5,6,6,6],[5,7,5,18]]}
["Master Score"]
["Individual Precision",null,null,null,null,null,null,null,null,null,null,null,null,null,"Final"]
["Event:","3rd Thailand Paramotor King's Cup Open",null,null,null,"Total No. of Pilots:",null,{"$f":"[1]PilotReg!$F$2","v":44}]
["Venue:","Nong Kho, Chonburi, Thailand"]
[]
["Wing No. ","Colour","Pilot Name","Gender","Team","Total Score","Rank","Task Score"]
[null,null,null,null,null,null,null,1,2,3,4,6,7,8,9,10,11,13,14]
["Automatic Fields. Do not modify manually."]
[21,{"$f":"LOOKUP(A9,[1]PilotReg!$A:$A,[1]PilotReg!$B:$B)","v":"Orange-Blue"},{"$f":"LOOKUP(A9,[1]PilotReg!$A:$A,[1]PilotReg!$E:$E)","v":"Kittiphop Phrommat"},{"$f":"LOOKUP(A9,[1]PilotReg!$A:$A,[1]PilotReg!$G:$G)","v":"M"},{"$f":"LOOKUP(A9,[1]PilotReg!$A:$A,[1]PilotReg!$F:$F)","v":"Mosquito"},{"$f":"SUM(H9:S9)","v":319},{"$f":"RANK(F9,$F:$F)","v":1},30,19,30,30,30,19,30,30,30,16,30,25]
[19,{"$f":"LOOKUP(A10,[1]PilotReg!$A:$A,[1]PilotReg!$B:$B)","v":"Blue-Green"},{"$f":"LOOKUP(A10,[1]PilotReg!$A:$A,[1]PilotReg!$E:$E)","v":"Phrompiriya Tapeanthong"},{"$f":"LOOKUP(A10,[1]PilotReg!$A:$A,[1]PilotReg!$G:$G)","v":"M"},{"$f":"LOOKUP(A10,[1]PilotReg!$A:$A,[1]PilotReg!$F:$F)","v":"Mosquito"},296,2,30,20,30,19,30,30,30,17,30,19,25,16]
[36,{"$f":"LOOKUP(A11,[1]PilotReg!$A:$A,[1]PilotReg!$B:$B)","v":"Orange-Blue"},{"$f":"LOOKUP(A11,[1]PilotReg!$A:$A,[1]PilotReg!$E:$E)","v":"Chayaphong Pothipuk"},{"$f":"LOOKUP(A11,[1]PilotReg!$A:$A,[1]PilotReg!$G:$G)","v":"M"},{"$f":"LOOKUP(A11,[1]PilotReg!$A:$A,[1]PilotReg!$F:$F)","v":"Polly Thailand"},285,3,30,3,30,25,30,20,30,18,30,25,30,14]
[29,{"$f":"LOOKUP(A12,[1]PilotReg!$A:$A,[1]PilotReg!$B:$B)","v":"Orange-Grey"},{"$f":"LOOKUP(A12,[1]PilotReg!$A:$A,[1]PilotReg!$E:$E)","v":"Pongnarin Somboon"},{"$f":"LOOKUP(A12,[1]PilotReg!$A:$A,[1]PilotReg!$G:$G)","v":"M"},{"$f":"LOOKUP(A12,[1]PilotReg!$A:$A,[1]PilotReg!$F:$F)","v":"Siam Junior"},281,4,30,30,30,17,30,10,25,19,30,22,30,8]
[5,{"$f":"LOOKUP(A13,[1]PilotReg!$A:$A,[1]PilotReg!$B:$B)","v":"Red-Orange"},{"$f":"LOOKUP(A13,[1]PilotReg!$A:$A,[1]PilotReg!$E:$E)","v":"Daniel Macak"},{"$f":"LOOKUP(A13,[1]PilotReg!$A:$A,[1]PilotReg!$G:$G)","v":"M"},{"$f":"LOOKUP(A13,[1]PilotReg!$A:$A,[1]PilotReg!$F:$F)","v":"Siam Junior"},276,5,30,18,30,18,30,7,30,20,30,15,30,18]
[34,{"$f":"LOOKUP(A14,[1]PilotReg!$A:$A,[1]PilotReg!$B:$B)","v":"Red-Grey"},{"$f":"LOOKUP(A14,[1]PilotReg!$A:$A,[1]PilotReg!$E:$E)","v":"Panupong Tipayachan"},{"$f":"LOOKUP(A14,[1]PilotReg!$A:$A,[1]PilotReg!$G:$G)","v":"M"},{"$f":"LOOKUP(A14,[1]PilotReg!$A:$A,[1]PilotReg!$F:$F)","v":"Aunza Thailand"},273,6,30,2,30,20,30,9,30,22,30,10,30,30]
[7,{"$f":"LOOKUP(A15,[1]PilotReg!$A:$A,[1]PilotReg!$B:$B)","v":"Red-Black"},{"$f":"LOOKUP(A15,[1]PilotReg!$A:$A,[1]PilotReg!$E:$E)","v":"Kerkrit Meunphukiew"},{"$f":"LOOKUP(A15,[1]PilotReg!$A:$A,[1]PilotReg!$G:$G)","v":"M"},{"$f":"LOOKUP(A15,[1]PilotReg!$A:$A,[1]PilotReg!$F:$F)","v":"Mosquito"},269,7,30,22,30,7,30,25,30,12,25,8,30,20]
[10,{"$f":"LOOKUP(A16,[1]PilotReg!$A:$A,[1]PilotReg!$B:$B)","v":"Orange-Blue"},{"$f":"LOOKUP(A16,[1]PilotReg!$A:$A,[1]PilotReg!$E:$E)","v":"Noparat Intharaumnuay"},{"$f":"LOOKUP(A16,[1]PilotReg!$A:$A,[1]PilotReg!$G:$G)","v":"M"},{"$f":"LOOKUP(A16,[1]PilotReg!$A:$A,[1]PilotReg!$F:$F)","v":"Mosquito"},264,8,30,10,30,16,30,22,30,13,30,8,30,15]
[33,{"$f":"LOOKUP(A17,[1]PilotReg!$A:$A,[1]PilotReg!$B:$B)","v":"Black-Yellow"},{"$f":"LOOKUP(A17,[1]PilotReg!$A:$A,[1]PilotReg!$E:$E)","v":"Pongkorn Thanasakulkornsaeng"},{"$f":"LOOKUP(A17,[1]PilotReg!$A:$A,[1]PilotReg!$G:$G)","v":"M"},{"$f":"LOOKUP(A17,[1]PilotReg!$A:$A,[1]PilotReg!$F:$F)","v":"Polly Thailand"},258,9,25,2,30,22,25,17,30,25,30,11,22,19]
[15,{"$f":"LOOKUP(A18,[1]PilotReg!$A:$A,[1]PilotReg!$B:$B)","v":"Blue-White"},{"$f":"LOOKUP(A18,[1]PilotReg!$A:$A,[1]PilotReg!$E:$E)","v":"David Graupera"},{"$f":"LOOKUP(A18,[1]PilotReg!$A:$A,[1]PilotReg!$G:$G)","v":"M"},{"$f":"LOOKUP(A18,[1]PilotReg!$A:$A,[1]PilotReg!$F:$F)","v":"Isarn Club"},257,10,30,2,30,14,25,16,30,15,30,18,30,17]
[12,{"$f":"LOOKUP(A19,[1]PilotReg!$A:$A,[1]PilotReg!$B:$B)","v":"Blue-White"},{"$f":"LOOKUP(A19,[1]PilotReg!$A:$A,[1]PilotReg!$E:$E)","v":"Noppanai Jaisawang"},{"$f":"LOOKUP(A19,[1]PilotReg!$A:$A,[1]PilotReg!$G:$G)","v":"M"},{"$f":"LOOKUP(A19,[1]PilotReg!$A:$A,[1]PilotReg!$F:$F)","v":"Moobin"},251,11,30,17,30,9,30,14,30,11,30,8,30,12]
[32,{"$f":"LOOKUP(A20,[1]PilotReg!$A:$A,[1]PilotReg!$B:$B)","v":"Red-White"},{"$f":"LOOKUP(A20,[1]PilotReg!$A:$A,[1]PilotReg!$E:$E)","v":"Saman Promnaree"},{"$f":"LOOKUP(A20,[1]PilotReg!$A:$A,[1]PilotReg!$G:$G)","v":"M"},{"$f":"LOOKUP(A20,[1]PilotReg!$A:$A,[1]PilotReg!$F:$F)","v":"Mosquito"},250,12,25,2,30,15,30,15,30,9,25,17,30,22]
{"$rows_left_out":33}
{"sheet":"IndividualEconomy","index":2,"n_rows":52,"n_cols":9,"rows_kept":52,"cut":false,"hidden":false,"merged":[[7,0,7,6],[1,5,1,6],[1,8,2,8],[5,0,6,0],[5,1,6,1],[5,2,6,2],[5,4,6,4],[5,5,6,5],[5,6,6,6],[5,7,5,8]]}
["Master Score"]
["Individual Economy",null,null,null,null,"Final"]
["Event:","3rd Thailand Paramotor King's Cup Open",null,null,null,"Total No. of Pilots:"]
["Venue:","Nong Kho, Chonburi, Thailand"]
[]
["Wing No. ","Colour","Pilot Name","Gender","Team","Total Score","Rank"]
[null,null,null,null,null,null,null,5,12]
["Automatic Fields. Do not modify manually."]
[21,{"$f":"LOOKUP(A9,[1]PilotReg!$A:$A,[1]PilotReg!$B:$B)","v":"Orange-Blue"},{"$f":"LOOKUP(A9,[1]PilotReg!$A:$A,[1]PilotReg!$E:$E)","v":"Kittiphop Phrommat"},{"$f":"LOOKUP(A9,[1]PilotReg!$A:$A,[1]PilotReg!$G:$G)","v":"M"},{"$f":"LOOKUP(A9,[1]PilotReg!$A:$A,[1]PilotReg!$F:$F)","v":"Mosquito"},{"$f":"SUM(H9:I9)","v":60},{"$f":"RANK(F9,$F:$F)","v":1},30,30]
[12,{"$f":"LOOKUP(A10,[1]PilotReg!$A:$A,[1]PilotReg!$B:$B)","v":"Blue-White"},{"$f":"LOOKUP(A10,[1]PilotReg!$A:$A,[1]PilotReg!$E:$E)","v":"Noppanai Jaisawang"},{"$f":"LOOKUP(A10,[1]PilotReg!$A:$A,[1]PilotReg!$G:$G)","v":"M"},{"$f":"LOOKUP(A10,[1]PilotReg!$A:$A,[1]PilotReg!$F:$F)","v":"Moobin"},44,2,22,22]
[5,{"$f":"LOOKUP(A11,[1]PilotReg!$A:$A,[1]PilotReg!$B:$B)","v":"Red-Orange"},{"$f":"LOOKUP(A11,[1]PilotReg!$A:$A,[1]PilotReg!$E:$E)","v":"Daniel Macak"},{"$f":"LOOKUP(A11,[1]PilotReg!$A:$A,[1]PilotReg!$G:$G)","v":"M"},{"$f":"LOOKUP(A11,[1]PilotReg!$A:$A,[1]PilotReg!$F:$F)","v":"Siam Junior"},42,3,17,25]
[15,{"$f":"LOOKUP(A12,[1]PilotReg!$A:$A,[1]PilotReg!$B:$B)","v":"Blue-White"},{"$f":"LOOKUP(A12,[1]PilotReg!$A:$A,[1]PilotReg!$E:$E)","v":"David Graupera"},{"$f":"LOOKUP(A12,[1]PilotReg!$A:$A,[1]PilotReg!$G:$G)","v":"M"},{"$f":"LOOKUP(A12,[1]PilotReg!$A:$A,[1]PilotReg!$F:$F)","v":"Isarn Club"},41,4,19,22]
[19,{"$f":"LOOKUP(A13,[1]PilotReg!$A:$A,[1]PilotReg!$B:$B)","v":"Blue-Green"},{"$f":"LOOKUP(A13,[1]PilotReg!$A:$A,[1]PilotReg!$E:$E)","v":"Phrompiriya Tapeanthong"},{"$f":"LOOKUP(A13,[1]PilotReg!$A:$A,[1]PilotReg!$G:$G)","v":"M"},{"$f":"LOOKUP(A13,[1]PilotReg!$A:$A,[1]PilotReg!$F:$F)","v":"Mosquito"},35,5,16,19]
[26,{"$f":"LOOKUP(A14,[1]PilotReg!$A:$A,[1]PilotReg!$B:$B)","v":"Red-Grey"},{"$f":"LOOKUP(A14,[1]PilotReg!$A:$A,[1]PilotReg!$E:$E)","v":"Pinit Kingtong"},{"$f":"LOOKUP(A14,[1]PilotReg!$A:$A,[1]PilotReg!$G:$G)","v":"M"},{"$f":"LOOKUP(A14,[1]PilotReg!$A:$A,[1]PilotReg!$F:$F)","v":"Moobin"},34,6,15,19]
[37,{"$f":"LOOKUP(A15,[1]PilotReg!$A:$A,[1]PilotReg!$B:$B)","v":"Grey-Red"},{"$f":"LOOKUP(A15,[1]PilotReg!$A:$A,[1]PilotReg!$E:$E)","v":"Sirichok Putaworn"},{"$f":"LOOKUP(A15,[1]PilotReg!$A:$A,[1]PilotReg!$G:$G)","v":"M"},{"$f":"LOOKUP(A15,[1]PilotReg!$A:$A,[1]PilotReg!$F:$F)","v":"Individual"},30,7,13,17]
[23,{"$f":"LOOKUP(A16,[1]PilotReg!$A:$A,[1]PilotReg!$B:$B)","v":"Black-Blue"},{"$f":"LOOKUP(A16,[1]PilotReg!$A:$A,[1]PilotReg!$E:$E)","v":"Prakit Binkaew"},{"$f":"LOOKUP(A16,[1]PilotReg!$A:$A,[1]PilotReg!$G:$G)","v":"M"},{"$f":"LOOKUP(A16,[1]PilotReg!$A:$A,[1]PilotReg!$F:$F)","v":"Individual"},28,8,12,16]
[45,{"$f":"LOOKUP(A17,[1]PilotReg!$A:$A,[1]PilotReg!$B:$B)","v":"Blue-Red"},{"$f":"LOOKUP(A17,[1]PilotReg!$A:$A,[1]PilotReg!$E:$E)","v":"Jiangsak Puangpee"},{"$f":"LOOKUP(A17,[1]PilotReg!$A:$A,[1]PilotReg!$G:$G)","v":"M"},{"$f":"LOOKUP(A17,[1]PilotReg!$A:$A,[1]PilotReg!$F:$F)","v":"Doklumduan"},27,9,14,13]
[30,{"$f":"LOOKUP(A18,[1]PilotReg!$A:$A,[1]PilotReg!$B:$B)","v":"Red-White"},{"$f":"LOOKUP(A18,[1]PilotReg!$A:$A,[1]PilotReg!$E:$E)","v":"Pattarin Insornsart"},{"$f":"LOOKUP(A18,[1]PilotReg!$A:$A,[1]PilotReg!$G:$G)","v":"F"},{"$f":"LOOKUP(A18,[1]PilotReg!$A:$A,[1]PilotReg!$F:$F)","v":"4st Mahongsorn"},27,9,25,2]
[29,{"$f":"LOOKUP(A19,[1]PilotReg!$A:$A,[1]PilotReg!$B:$B)","v":"Orange-Grey"},{"$f":"LOOKUP(A19,[1]PilotReg!$A:$A,[1]PilotReg!$E:$E)","v":"Pongnarin Somboon"},{"$f":"LOOKUP(A19,[1]PilotReg!$A:$A,[1]PilotReg!$G:$G)","v":"M"},{"$f":"LOOKUP(A19,[1]PilotReg!$A:$A,[1]PilotReg!$F:$F)","v":"Siam Junior"},23,11,10,13]
[32,{"$f":"LOOKUP(A20,[1]PilotReg!$A:$A,[1]PilotReg!$B:$B)","v":"Red-White"},{"$f":"LOOKUP(A20,[1]PilotReg!$A:$A,[1]PilotReg!$E:$E)","v":"Saman Promnaree"},{"$f":"LOOKUP(A20,[1]PilotReg!$A:$A,[1]PilotReg!$G:$G)","v":"M"},{"$f":"LOOKUP(A20,[1]PilotReg!$A:$A,[1]PilotReg!$F:$F)","v":"Mosquito"},23,11,8,15]
{"$rows_left_out":33}
{"sheet":"TeamCombined","index":3,"n_rows":60,"n_cols":6,"rows_kept":60,"cut":false,"hidden":false,"merged":[]}
[]
[]
["Row Labels","Sum of Total Score"]
["Mosquito",1547]
["Kerkrit Meunphukiew",285]
["Kittiphop Phrommat",379,null,"Event: 3rd Thailand Paramotor King's Cup Open"]
["Noparat Intharaumnuay",279,null,"Venue: Nong Kho, Chonburi, Thailand"]
["Phrompiriya Tapeanthong",331,null,"Team Combined",null,"Final"]
["Saman Promnaree",273,null,"Team","Sum of Top 3","Rank"]
["Moobin",1201,null,"Mosquito",{"$f":"SUM(LARGE($B$5:$B$9,{1,2,3}))","v":995},{"$f":"RANK(E10,$E$10:$E$18)","v":1}]
["Chakrit Babphan",209,null,"Siam Junior",{"$f":"SUM(LARGE($B$17:$B$21,{1,2,3}))","v":827},2]
["Noppanai Jaisawang",295,null,"Polly Thailand",{"$f":"SUM(LARGE($B$35:$B$38,{1,2,3}))","v":794},3]
["Nutchai Dadrung",207,null,"Moobin",{"$f":"SUM(LARGE($B$11:$B$15,{1,2,3}))","v":785},4]
["Pinit Kingtong",269,null,"Isarn Club",{"$f":"SUM(LARGE($B$29:$B$33,{1,2,3}))","v":728},5]
["Somponk Busabonk",221,null,"Doklumduan",{"$f":"SUM(LARGE($B$23:$B$27,{1,2,3}))","v":670},6]
["Siam Junior",1084,null,"4st Mahongsorn",{"$f":"SUM(LARGE($B$40:$B$43,{1,2,3}))","v":664},7]
["A  Aongard",205,null,"Aunza Thailand",{"$f":"SUM(LARGE(B50:B53,{1,2,3}))","v":654},8]
["Daniel Macak",318,null,"Ubonratchathani Aero Club",{"$f":"SUM(LARGE($B$55:$B$57,{1,2,3}))","v":573},9]
["Naruporn Wathaya",54]
["Plaifha Thongdonpum",203]
{"$rows_left_out":40}